BDBM50371248 CHEMBL254385
SMILES: Cc1cccc(NC(=O)c2cc(co2)-c2ccc(Cl)cc2)c1
InChI Key: InChIKey=PFYSJOOYFVVVCF-UHFFFAOYSA-N
Data: 1 IC50
Activity Spreadsheet -- Enzyme Inhibition Constant Data from BindingDB
Found 1 hit for monomerid = 50371248
Trg + Lig
Ki
nM
ΔG°
kcal/mole
IC50
nM
Kd
nM
EC50/IC50
nM
koff
s-1
kon
M-1s-1
pHTemp
°C
Sodium channel protein type X alpha subunit
(Mus musculus)
BDBM50371248
(CHEMBL254385)
Show SMILES Cc1cccc(NC(=O)c2cc(co2)-c2ccc(Cl)cc2)c1
Show InChI InChI=1S/C18H14ClNO2/c1-12-3-2-4-16(9-12)20-18(21)17-10-14(11-22-17)13-5-7-15(19)8-6-13/h2-11H,1H3,(H,20,21)
n/an/a 5.30E+3n/an/an/an/an/an/a
Abbott Laboratories
Curated by ChEMBL
Assay Description
Inhibition of mouse recombinant Nav 1.8 channel expressed in HEK293 cells by isotopic efflux assay
J Med Chem 51: 407-16 (2008)
Article DOI: 10.1021/jm070637u
BindingDB Entry DOI: 10.7270/Q2KK9CN7