BDBM50371390 CHEMBL272039
SMILES: NC(=O)C(c1ccc(F)cc1)(c1ccc(F)cc1)c1ccccc1F
InChI Key: InChIKey=VDPKWHHLYDETTO-UHFFFAOYSA-N
Data: 1 IC50
Activity Spreadsheet -- Enzyme Inhibition Constant Data from BindingDB
Found 1 hit for monomerid = 50371390
Trg + Lig
Ki
nM
ΔG°
kcal/mole
IC50
nM
Kd
nM
EC50/IC50
nM
koff
s-1
kon
M-1s-1
pHTemp
°C
Intermediate conductance calcium-activated potassium channel protein 4
(Homo sapiens (Human))
BDBM50371390
(CHEMBL272039)
Show SMILES NC(=O)C(c1ccc(F)cc1)(c1ccc(F)cc1)c1ccccc1F
Show InChI InChI=1S/C20H14F3NO/c21-15-9-5-13(6-10-15)20(19(24)25,14-7-11-16(22)12-8-14)17-3-1-2-4-18(17)23/h1-12H,(H2,24,25)
Reactome pathway
n/an/a 10n/an/an/an/an/an/a
Icagen, Inc.
Curated by ChEMBL
Assay Description
Inhibition of Gardos channel in human RBC assessed as inhibition of ionomycin-stimulated [86Rb] efflux
J Med Chem 51: 976-82 (2008)
Article DOI: 10.1021/jm070663s
BindingDB Entry DOI: 10.7270/Q23F4QGH