BDBM50371693 CHEMBL402086
SMILES: CC(C)(N)C(=O)N[C@H](COCc1ccccc1)c1nnnn1CC(Cc1ccccc1)C#N
InChI Key: InChIKey=VGSWFWOESBQVOY-BPGUCPLFSA-N
Data: 1 KI  1 EC50
Activity Spreadsheet -- Enzyme Inhibition Constant Data from BindingDB
Found 2 hits for monomerid = 50371693
Trg + Lig
Ki
nM
ΔG°
kcal/mole
IC50
nM
Kd
nM
EC50/IC50
nM
koff
s-1
kon
M-1s-1
pHTemp
°C
Growth hormone secretagogue receptor type 1
(Homo sapiens (Human))
BDBM50371693
(CHEMBL402086)
Show SMILES CC(C)(N)C(=O)N[C@H](COCc1ccccc1)c1nnnn1CC(Cc1ccccc1)C#N |w:23.24|
Show InChI InChI=1S/C24H29N7O2/c1-24(2,26)23(32)27-21(17-33-16-19-11-7-4-8-12-19)22-28-29-30-31(22)15-20(14-25)13-18-9-5-3-6-10-18/h3-12,20-21H,13,15-17,26H2,1-2H3,(H,27,32)/t20?,21-/m1/s1
Reactome pathway
298n/an/an/an/an/an/an/an/a
Bristol-Myers Squibb Pharmaceutical Research Institute
Curated by ChEMBL
Assay Description
Agonist activity at human GHS receptor expressed in H4 glioma cells
Bioorg Med Chem Lett 18: 2067-72 (2008)
Article DOI: 10.1016/j.bmcl.2008.01.100
BindingDB Entry DOI: 10.7270/Q21G0N4D
Growth hormone secretagogue receptor type 1
(Homo sapiens (Human))
BDBM50371693
(CHEMBL402086)
Show SMILES CC(C)(N)C(=O)N[C@H](COCc1ccccc1)c1nnnn1CC(Cc1ccccc1)C#N |w:23.24|
Show InChI InChI=1S/C24H29N7O2/c1-24(2,26)23(32)27-21(17-33-16-19-11-7-4-8-12-19)22-28-29-30-31(22)15-20(14-25)13-18-9-5-3-6-10-18/h3-12,20-21H,13,15-17,26H2,1-2H3,(H,27,32)/t20?,21-/m1/s1
Reactome pathway
n/an/an/an/a 22n/an/an/an/a
Bristol-Myers Squibb Pharmaceutical Research Institute
Curated by ChEMBL
Assay Description
Agonist activity at human GHS receptor expressed in H4 glioma cells assessed as intracellular calcium concentration by FLIPR assay
Bioorg Med Chem Lett 18: 2067-72 (2008)
Article DOI: 10.1016/j.bmcl.2008.01.100
BindingDB Entry DOI: 10.7270/Q21G0N4D