BDBM50371774 CHEMBL429791
SMILES: C[C@H](CO)Nc1nc(SCc2cccc(Cl)c2F)nc2nc(N)sc12
InChI Key: InChIKey=FQIAAOXQRBGGTL-SSDOTTSWSA-N
Data: 1 IC50
Activity Spreadsheet -- Enzyme Inhibition Constant Data from BindingDB
Found 1 hit for monomerid = 50371774
Trg + Lig
Ki
nM
ΔG°
kcal/mole
IC50
nM
Kd
nM
EC50/IC50
nM
koff
s-1
kon
M-1s-1
pHTemp
°C
C-X-C chemokine receptor type 2
(Homo sapiens (Human))
BDBM50371774
(CHEMBL429791)
Show SMILES C[C@H](CO)Nc1nc(SCc2cccc(Cl)c2F)nc2nc(N)sc12
Show InChI InChI=1S/C15H15ClFN5OS2/c1-7(5-23)19-12-11-13(20-14(18)25-11)22-15(21-12)24-6-8-3-2-4-9(16)10(8)17/h2-4,7,23H,5-6H2,1H3,(H3,18,19,20,21,22)/t7-/m1/s1
Reactome pathway
n/an/a 3n/an/an/an/an/an/a
AstraZeneca R&D Charnwood
Curated by ChEMBL
Assay Description
Displacement of [125I]IL8 from human recombinant CXCR2 expressed in HEK293 cells by SPA assay
Bioorg Med Chem Lett 18: 798-803 (2008)
BindingDB Entry DOI: 10.7270/Q28053GH