null
SMILES: C[C@H](CO)Nc1nc(SCc2cccc(F)c2F)nc2[nH]c(=O)c(=O)[nH]c12
InChI Key: InChIKey=JKQZCRKCTVGXSM-SSDOTTSWSA-N
Activity Spreadsheet -- Enzyme Inhibition Constant Data from BindingDB
Found 1 hit for monomerid = 50371786
Trg + Lig
Ki
nM
ΔG°
kcal/mole
IC50
nM
Kd
nM
EC50/IC50
nM
koff
s-1
kon
M-1s-1
pHTemp
°C
C-X-C chemokine receptor type 2
(Homo sapiens (Human))
BDBM50371786
(CHEMBL403877)
Show SMILES C[C@H](CO)Nc1nc(SCc2cccc(F)c2F)nc2[nH]c(=O)c(=O)[nH]c12
Show InChI InChI=1S/C16H15F2N5O3S/c1-7(5-24)19-12-11-13(21-15(26)14(25)20-11)23-16(22-12)27-6-8-3-2-4-9(17)10(8)18/h2-4,7,24H,5-6H2,1H3,(H,20,25)(H2,19,21,22,23,26)/t7-/m1/s1
Reactome pathway
n/an/a 45n/an/an/an/an/an/a
AstraZeneca R&D Charnwood
Curated by ChEMBL
Assay Description
Displacement of [125I]IL8 from human recombinant CXCR2 expressed in HEK293 cells by SPA assay
Bioorg Med Chem Lett 18: 798-803 (2008)
BindingDB Entry DOI: 10.7270/Q28053GH