BDBM50371794 CHEMBL270446
SMILES: C[C@H](CO)Nc1nc(SCc2cccc(F)c2F)nc2nc(C)[nH]c12
InChI Key: InChIKey=IQXMSKNDTHUFOZ-MRVPVSSYSA-N
Data: 1 IC50
Activity Spreadsheet -- Enzyme Inhibition Constant Data from BindingDB
Found 1 hit for monomerid = 50371794
Trg + Lig
Ki
nM
ΔG°
kcal/mole
IC50
nM
Kd
nM
EC50/IC50
nM
koff
s-1
kon
M-1s-1
pHTemp
°C
C-X-C chemokine receptor type 2
(Homo sapiens (Human))
BDBM50371794
(CHEMBL270446)
Show SMILES C[C@H](CO)Nc1nc(SCc2cccc(F)c2F)nc2nc(C)[nH]c12
Show InChI InChI=1S/C16H17F2N5OS/c1-8(6-24)19-14-13-15(21-9(2)20-13)23-16(22-14)25-7-10-4-3-5-11(17)12(10)18/h3-5,8,24H,6-7H2,1-2H3,(H2,19,20,21,22,23)/t8-/m1/s1
Reactome pathway
n/an/a 630n/an/an/an/an/an/a
AstraZeneca R&D Charnwood
Curated by ChEMBL
Assay Description
Displacement of [125I]IL8 from human recombinant CXCR2 expressed in HEK293 cells by SPA assay
Bioorg Med Chem Lett 18: 798-803 (2008)
BindingDB Entry DOI: 10.7270/Q28053GH