BDBM50371873 CHEMBL403730
SMILES: CC(C)C(=O)Nc1cccc(CCCN2CCC(CC2)n2c(C)nc3cc(C)ccc23)c1
InChI Key: InChIKey=UEXMLAHFKICZJK-UHFFFAOYSA-N
Data: 1 KI  1 EC50
Activity Spreadsheet -- Enzyme Inhibition Constant Data from BindingDB
Found 2 hits for monomerid = 50371873
Trg + Lig
Ki
nM
ΔG°
kcal/mole
IC50
nM
Kd
nM
EC50/IC50
nM
koff
s-1
kon
M-1s-1
pHTemp
°C
Melanin-concentrating hormone receptor
(Homo sapiens (Human))
BDBM50371873
(CHEMBL403730)
Show SMILES CC(C)C(=O)Nc1cccc(CCCN2CCC(CC2)n2c(C)nc3cc(C)ccc23)c1
Show InChI InChI=1S/C27H36N4O/c1-19(2)27(32)29-23-9-5-7-22(18-23)8-6-14-30-15-12-24(13-16-30)31-21(4)28-25-17-20(3)10-11-26(25)31/h5,7,9-11,17-19,24H,6,8,12-16H2,1-4H3,(H,29,32)
Reactome pathway
25n/an/an/an/an/an/an/an/a
Hoffmann-La Roche, Inc.
Curated by ChEMBL
Assay Description
Binding affinity to MCHR1
Bioorg Med Chem Lett 18: 1402-6 (2008)
Article DOI: 10.1016/j.bmcl.2008.01.010
BindingDB Entry DOI: 10.7270/Q2M909HR
Melanin-concentrating hormone receptor
(Homo sapiens (Human))
BDBM50371873
(CHEMBL403730)
Show SMILES CC(C)C(=O)Nc1cccc(CCCN2CCC(CC2)n2c(C)nc3cc(C)ccc23)c1
Show InChI InChI=1S/C27H36N4O/c1-19(2)27(32)29-23-9-5-7-22(18-23)8-6-14-30-15-12-24(13-16-30)31-21(4)28-25-17-20(3)10-11-26(25)31/h5,7,9-11,17-19,24H,6,8,12-16H2,1-4H3,(H,29,32)
Reactome pathway
n/an/an/an/a 175n/an/an/an/a
Hoffmann-La Roche, Inc.
Curated by ChEMBL
Assay Description
Antagonist activity at MCHR1 by cAMP assay
Bioorg Med Chem Lett 18: 1402-6 (2008)
Article DOI: 10.1016/j.bmcl.2008.01.010
BindingDB Entry DOI: 10.7270/Q2M909HR