BDBM50371919 CHEMBL436651
SMILES: Cc1cc(on1)-c1c(C2=CCCCCC2)c2cc(Cl)ccc2[nH]c1=O
InChI Key: InChIKey=GSQRZAKCDMEPEX-UHFFFAOYSA-N
Data: 1 IC50
Activity Spreadsheet -- Enzyme Inhibition Constant Data from BindingDB
Found 1 hit for monomerid = 50371919
Trg + Lig
Ki
nM
ΔG°
kcal/mole
IC50
nM
Kd
nM
EC50/IC50
nM
koff
s-1
kon
M-1s-1
pHTemp
°C
Macrophage colony stimulating factor receptor
(Homo sapiens (Human))
BDBM50371919
(CHEMBL436651)
Show SMILES Cc1cc(on1)-c1c(C2=CCCCCC2)c2cc(Cl)ccc2[nH]c1=O |t:9|
Show InChI InChI=1S/C20H19ClN2O2/c1-12-10-17(25-23-12)19-18(13-6-4-2-3-5-7-13)15-11-14(21)8-9-16(15)22-20(19)24/h6,8-11H,2-5,7H2,1H3,(H,22,24)
n/an/a 90n/an/an/an/an/an/a
Johnson& Johnson Pharmaceutical Research& Development
Curated by ChEMBL
Assay Description
Inhibition of human cytoplasmic macrophage colony-stimulating factor 1 receptor by fluorescence polarization
Bioorg Med Chem Lett 18: 2097-102 (2008)
Article DOI: 10.1016/j.bmcl.2008.01.088
BindingDB Entry DOI: 10.7270/Q23779JH