BDBM50371923 CHEMBL255213
SMILES: CCc1ccc(cc1)-c1c(-c2cc(C)no2)c(=O)[nH]c2ccc(Cl)cc12
InChI Key: InChIKey=QQBZYCMMAPITCR-UHFFFAOYSA-N
Data: 1 IC50
Activity Spreadsheet -- Enzyme Inhibition Constant Data from BindingDB
Found 1 hit for monomerid = 50371923
Trg + Lig
Ki
nM
ΔG°
kcal/mole
IC50
nM
Kd
nM
EC50/IC50
nM
koff
s-1
kon
M-1s-1
pHTemp
°C
Macrophage colony stimulating factor receptor
(Homo sapiens (Human))
BDBM50371923
(CHEMBL255213)
Show SMILES CCc1ccc(cc1)-c1c(-c2cc(C)no2)c(=O)[nH]c2ccc(Cl)cc12
Show InChI InChI=1S/C21H17ClN2O2/c1-3-13-4-6-14(7-5-13)19-16-11-15(22)8-9-17(16)23-21(25)20(19)18-10-12(2)24-26-18/h4-11H,3H2,1-2H3,(H,23,25)
n/an/a 90n/an/an/an/an/an/a
Johnson& Johnson Pharmaceutical Research& Development
Curated by ChEMBL
Assay Description
Inhibition of human cytoplasmic macrophage colony-stimulating factor 1 receptor by fluorescence polarization
Bioorg Med Chem Lett 18: 2097-102 (2008)
Article DOI: 10.1016/j.bmcl.2008.01.088
BindingDB Entry DOI: 10.7270/Q23779JH