BDBM50371934 CHEMBL272119
SMILES: Cc1cc(on1)-c1c(-c2ccccc2)c2cc(ccc2[nH]c1=O)C#N
InChI Key: InChIKey=XWTSEAVOHNVHIO-UHFFFAOYSA-N
Data: 1 IC50
Activity Spreadsheet -- Enzyme Inhibition Constant Data from BindingDB
Found 1 hit for monomerid = 50371934
Trg + Lig
Ki
nM
ΔG°
kcal/mole
IC50
nM
Kd
nM
EC50/IC50
nM
koff
s-1
kon
M-1s-1
pHTemp
°C
Macrophage colony stimulating factor receptor
(Homo sapiens (Human))
BDBM50371934
(CHEMBL272119)
Show SMILES Cc1cc(on1)-c1c(-c2ccccc2)c2cc(ccc2[nH]c1=O)C#N
Show InChI InChI=1S/C20H13N3O2/c1-12-9-17(25-23-12)19-18(14-5-3-2-4-6-14)15-10-13(11-21)7-8-16(15)22-20(19)24/h2-10H,1H3,(H,22,24)
n/an/a 90n/an/an/an/an/an/a
Johnson& Johnson Pharmaceutical Research& Development
Curated by ChEMBL
Assay Description
Inhibition of human cytoplasmic macrophage colony-stimulating factor 1 receptor by fluorescence polarization
Bioorg Med Chem Lett 18: 2097-102 (2008)
Article DOI: 10.1016/j.bmcl.2008.01.088
BindingDB Entry DOI: 10.7270/Q23779JH