null
SMILES: CC12C[C@H](O)C(C)(O1)c1c(O)n(c(O)c21)-c1ccc(C#N)c(I)c1
InChI Key: InChIKey=YLWBAIINNOCRMM-OSSATUEASA-N
Activity Spreadsheet -- Enzyme Inhibition Constant Data from BindingDB
Found 2 hits for monomerid = 50372079
Trg + Lig
Ki
nM
ΔG°
kcal/mole
IC50
nM
Kd
nM
EC50/IC50
nM
koff
s-1
kon
M-1s-1
pHTemp
°C
Androgen receptor
(Homo sapiens (Human))
BDBM50372079
(CHEMBL255331)
Show SMILES CC12C[C@H](O)C(C)(O1)c1c(O)n(c(O)c21)-c1ccc(C#N)c(I)c1 |TLB:4:3:7:14.8,THB:9:8:7:3.2,12:14:7:3.2|
Show InChI InChI=1S/C17H15IN2O4/c1-16-6-11(21)17(2,24-16)13-12(16)14(22)20(15(13)23)9-4-3-8(7-19)10(18)5-9/h3-5,11,21-23H,6H2,1-2H3/t11-,16?,17?/m0/s1
NCI pathway
Reactome pathway
7.18n/an/an/an/an/an/an/an/a
Bristol-Myers Squibb Pharmaceutical Research and Development
Curated by ChEMBL
Assay Description
Displacement of [3H]DHT from human androgen receptor in MDA453 cells
Bioorg Med Chem Lett 18: 1910-5 (2008)
Article DOI: 10.1016/j.bmcl.2008.02.006
BindingDB Entry DOI: 10.7270/Q2DJ5GGT
Androgen receptor
(Homo sapiens (Human))
BDBM50372079
(CHEMBL255331)
Show SMILES CC12C[C@H](O)C(C)(O1)c1c(O)n(c(O)c21)-c1ccc(C#N)c(I)c1 |TLB:4:3:7:14.8,THB:9:8:7:3.2,12:14:7:3.2|
Show InChI InChI=1S/C17H15IN2O4/c1-16-6-11(21)17(2,24-16)13-12(16)14(22)20(15(13)23)9-4-3-8(7-19)10(18)5-9/h3-5,11,21-23H,6H2,1-2H3/t11-,16?,17?/m0/s1
NCI pathway
Reactome pathway
n/an/a 10n/an/an/an/an/an/a
Bristol-Myers Squibb Pharmaceutical Research and Development
Curated by ChEMBL
Assay Description
Antagonist activity at human androgen receptor in MDA453 cells by alkaline phosphatase reporter gene assay
Bioorg Med Chem Lett 18: 1910-5 (2008)
Article DOI: 10.1016/j.bmcl.2008.02.006
BindingDB Entry DOI: 10.7270/Q2DJ5GGT