null
SMILES: CC12CCC(C)(O1)c1c(O)n(c(O)c21)-c1ccc(C#N)n2nccc12
InChI Key: InChIKey=WNJNULWPKXTWNI-UHFFFAOYSA-N
Activity Spreadsheet -- Enzyme Inhibition Constant Data from BindingDB
Found 2 hits for monomerid = 50372081
Trg + Lig
Ki
nM
ΔG°
kcal/mole
IC50
nM
Kd
nM
EC50/IC50
nM
koff
s-1
kon
M-1s-1
pHTemp
°C
Androgen receptor
(Homo sapiens (Human))
BDBM50372081
(CHEMBL255216)
Show SMILES CC12CCC(C)(O1)c1c(O)n(c(O)c21)-c1ccc(C#N)n2nccc12 |THB:11:13:6:2.3,8:7:6:2.3,(29.8,-48.84,;28.47,-49.62,;29.36,-50.93,;28.45,-51.68,;27.58,-50.57,;26.88,-51.94,;28.81,-48.25,;26.1,-50.61,;25.06,-49.84,;23.83,-50.24,;25.46,-48.62,;26.76,-48.62,;27.39,-47.5,;27.15,-49.85,;24.13,-47.85,;22.79,-48.62,;21.45,-47.85,;21.45,-46.31,;20.12,-45.55,;18.78,-44.79,;22.77,-45.53,;23.1,-44.01,;24.64,-43.86,;25.27,-45.27,;24.11,-46.3,)|
Show InChI InChI=1S/C18H16N4O3/c1-17-6-7-18(2,25-17)14-13(17)15(23)21(16(14)24)11-4-3-10(9-19)22-12(11)5-8-20-22/h3-5,8,23-24H,6-7H2,1-2H3
NCI pathway
Reactome pathway
18n/an/an/an/an/an/an/an/a
Bristol-Myers Squibb Pharmaceutical Research and Development
Curated by ChEMBL
Assay Description
Displacement of [3H]DHT from human androgen receptor in MDA453 cells
Bioorg Med Chem Lett 18: 1910-5 (2008)
Article DOI: 10.1016/j.bmcl.2008.02.006
BindingDB Entry DOI: 10.7270/Q2DJ5GGT
Androgen receptor
(Homo sapiens (Human))
BDBM50372081
(CHEMBL255216)
Show SMILES CC12CCC(C)(O1)c1c(O)n(c(O)c21)-c1ccc(C#N)n2nccc12 |THB:11:13:6:2.3,8:7:6:2.3,(29.8,-48.84,;28.47,-49.62,;29.36,-50.93,;28.45,-51.68,;27.58,-50.57,;26.88,-51.94,;28.81,-48.25,;26.1,-50.61,;25.06,-49.84,;23.83,-50.24,;25.46,-48.62,;26.76,-48.62,;27.39,-47.5,;27.15,-49.85,;24.13,-47.85,;22.79,-48.62,;21.45,-47.85,;21.45,-46.31,;20.12,-45.55,;18.78,-44.79,;22.77,-45.53,;23.1,-44.01,;24.64,-43.86,;25.27,-45.27,;24.11,-46.3,)|
Show InChI InChI=1S/C18H16N4O3/c1-17-6-7-18(2,25-17)14-13(17)15(23)21(16(14)24)11-4-3-10(9-19)22-12(11)5-8-20-22/h3-5,8,23-24H,6-7H2,1-2H3
NCI pathway
Reactome pathway
n/an/a 88n/an/an/an/an/an/a
Bristol-Myers Squibb Pharmaceutical Research and Development
Curated by ChEMBL
Assay Description
Antagonist activity at human androgen receptor in MDA453 cells by alkaline phosphatase reporter gene assay
Bioorg Med Chem Lett 18: 1910-5 (2008)
Article DOI: 10.1016/j.bmcl.2008.02.006
BindingDB Entry DOI: 10.7270/Q2DJ5GGT