BDBM50372192 CHEMBL257091
SMILES: CCCN(CCC)C(=O)c1cc(C)cc(c1)C(=O)N[C@@H](Cc1cc(F)cc(F)c1)[C@H](O)[C@H]1C[C@H](CCN1)C1CCCCC1
InChI Key: InChIKey=HPZJATXZBWZOFX-NEVPTIFISA-N
Data: 2 IC50
Activity Spreadsheet -- Enzyme Inhibition Constant Data from BindingDB
Found 2 hits for monomerid = 50372192
Trg + Lig
Ki
nM
ΔG°
kcal/mole
IC50
nM
Kd
nM
EC50/IC50
nM
koff
s-1
kon
M-1s-1
pHTemp
°C
Beta-secretase 1
(Homo sapiens (Human))
BDBM50372192
(CHEMBL257091)
Show SMILES CCCN(CCC)C(=O)c1cc(C)cc(c1)C(=O)N[C@@H](Cc1cc(F)cc(F)c1)[C@H](O)[C@H]1C[C@H](CCN1)C1CCCCC1
Show InChI InChI=1S/C35H49F2N3O3/c1-4-13-40(14-5-2)35(43)28-16-23(3)15-27(20-28)34(42)39-32(19-24-17-29(36)22-30(37)18-24)33(41)31-21-26(11-12-38-31)25-9-7-6-8-10-25/h15-18,20,22,25-26,31-33,38,41H,4-14,19,21H2,1-3H3,(H,39,42)/t26-,31+,32-,33+/m0/s1
n/an/a 4.20E+3n/an/an/an/an/an/a
Schering-Plough Research Institute
Curated by ChEMBL
Assay Description
Inhibition of human BACE1 assessed as amyloid beta 40 production in human HEK293 cells by ELISA
Bioorg Med Chem Lett 18: 414-7 (2008)
Article DOI: 10.1016/j.bmcl.2007.10.116
BindingDB Entry DOI: 10.7270/Q2RV0PJH
Beta-secretase 1
(Homo sapiens (Human))
BDBM50372192
(CHEMBL257091)
Show SMILES CCCN(CCC)C(=O)c1cc(C)cc(c1)C(=O)N[C@@H](Cc1cc(F)cc(F)c1)[C@H](O)[C@H]1C[C@H](CCN1)C1CCCCC1
Show InChI InChI=1S/C35H49F2N3O3/c1-4-13-40(14-5-2)35(43)28-16-23(3)15-27(20-28)34(42)39-32(19-24-17-29(36)22-30(37)18-24)33(41)31-21-26(11-12-38-31)25-9-7-6-8-10-25/h15-18,20,22,25-26,31-33,38,41H,4-14,19,21H2,1-3H3,(H,39,42)/t26-,31+,32-,33+/m0/s1
n/an/a 610n/an/an/an/an/an/a
Schering-Plough Research Institute
Curated by ChEMBL
Assay Description
Inhibition of human BACE1
Bioorg Med Chem Lett 18: 414-7 (2008)
Article DOI: 10.1016/j.bmcl.2007.10.116
BindingDB Entry DOI: 10.7270/Q2RV0PJH