BDBM50372433 CHEMBL405504
SMILES: ONC(=O)c1cc2cc(ccc2s1)C(=O)NCc1ccccc1
InChI Key: InChIKey=VJPCTQDOQXHLDM-UHFFFAOYSA-N
Data: 1 IC50
Activity Spreadsheet -- Enzyme Inhibition Constant Data from BindingDB
Found 1 hit for monomerid = 50372433
Trg + Lig
Ki
nM
ΔG°
kcal/mole
IC50
nM
Kd
nM
EC50/IC50
nM
koff
s-1
kon
M-1s-1
pHTemp
°C
Histone deacetylase 1
(Homo sapiens (Human))
BDBM50372433
(CHEMBL405504)
Show SMILES ONC(=O)c1cc2cc(ccc2s1)C(=O)NCc1ccccc1
Show InChI InChI=1S/C17H14N2O3S/c20-16(18-10-11-4-2-1-3-5-11)12-6-7-14-13(8-12)9-15(23-14)17(21)19-22/h1-9,22H,10H2,(H,18,20)(H,19,21)
NCI pathway
Reactome pathway
n/an/a 76n/an/an/an/an/an/a
Menarini Ricerche
Curated by ChEMBL
Assay Description
Inhibition of human HDAC1
J Med Chem 51: 1505-29 (2008)
Article DOI: 10.1021/jm7011408
BindingDB Entry DOI: 10.7270/Q2M32WMT