BDBM50372435 CHEMBL270098
SMILES: ONC(=O)c1cc2ccc(NC(=O)c3ccc4ccccc4c3)cc2s1
InChI Key: InChIKey=PCQHVKPOXPTMOB-UHFFFAOYSA-N
Data: 1 IC50
Activity Spreadsheet -- Enzyme Inhibition Constant Data from BindingDB
Found 1 hit for monomerid = 50372435
Trg + Lig
Ki
nM
ΔG°
kcal/mole
IC50
nM
Kd
nM
EC50/IC50
nM
koff
s-1
kon
M-1s-1
pHTemp
°C
Histone deacetylase 1
(Homo sapiens (Human))
BDBM50372435
(CHEMBL270098)
Show SMILES ONC(=O)c1cc2ccc(NC(=O)c3ccc4ccccc4c3)cc2s1
Show InChI InChI=1S/C20H14N2O3S/c23-19(15-6-5-12-3-1-2-4-13(12)9-15)21-16-8-7-14-10-18(20(24)22-25)26-17(14)11-16/h1-11,25H,(H,21,23)(H,22,24)
NCI pathway
Reactome pathway
n/an/a 79n/an/an/an/an/an/a
Menarini Ricerche
Curated by ChEMBL
Assay Description
Inhibition of human HDAC1
J Med Chem 51: 1505-29 (2008)
Article DOI: 10.1021/jm7011408
BindingDB Entry DOI: 10.7270/Q2M32WMT