BDBM50372436 CHEMBL259027
SMILES: ONC(=O)c1cc2cc(NC(=O)c3ccccc3)ccc2s1
InChI Key: InChIKey=YWKVUIZHAYBTCW-UHFFFAOYSA-N
Data: 1 IC50
Activity Spreadsheet -- Enzyme Inhibition Constant Data from BindingDB
Found 1 hit for monomerid = 50372436
Trg + Lig
Ki
nM
ΔG°
kcal/mole
IC50
nM
Kd
nM
EC50/IC50
nM
koff
s-1
kon
M-1s-1
pHTemp
°C
Histone deacetylase 1
(Homo sapiens (Human))
BDBM50372436
(CHEMBL259027)
Show SMILES ONC(=O)c1cc2cc(NC(=O)c3ccccc3)ccc2s1
Show InChI InChI=1S/C16H12N2O3S/c19-15(10-4-2-1-3-5-10)17-12-6-7-13-11(8-12)9-14(22-13)16(20)18-21/h1-9,21H,(H,17,19)(H,18,20)
NCI pathway
Reactome pathway
n/an/a 107n/an/an/an/an/an/a
Menarini Ricerche
Curated by ChEMBL
Assay Description
Inhibition of human HDAC1
J Med Chem 51: 1505-29 (2008)
Article DOI: 10.1021/jm7011408
BindingDB Entry DOI: 10.7270/Q2M32WMT