BDBM50372438 CHEMBL272613
SMILES: CC(=O)SCC(=O)CCCCCCC(=O)Nc1ccccc1
InChI Key: InChIKey=OCDCFMXSXAYLLI-UHFFFAOYSA-N
Data: 1 IC50
Activity Spreadsheet -- Enzyme Inhibition Constant Data from BindingDB
Found 1 hit for monomerid = 50372438
Trg + Lig
Ki
nM
ΔG°
kcal/mole
IC50
nM
Kd
nM
EC50/IC50
nM
koff
s-1
kon
M-1s-1
pHTemp
°C
Histone deacetylase 8
(Homo sapiens (Human))
BDBM50372438
(CHEMBL272613)
Show SMILES CC(=O)SCC(=O)CCCCCCC(=O)Nc1ccccc1
Show InChI InChI=1S/C17H23NO3S/c1-14(19)22-13-16(20)11-7-2-3-8-12-17(21)18-15-9-5-4-6-10-15/h4-6,9-10H,2-3,7-8,11-13H2,1H3,(H,18,21)
NCI pathway
Reactome pathway
n/an/a 190n/an/an/an/an/an/a
Menarini Ricerche
Curated by ChEMBL
Assay Description
Inhibition of human HDAC8
J Med Chem 51: 1505-29 (2008)
Article DOI: 10.1021/jm7011408
BindingDB Entry DOI: 10.7270/Q2M32WMT