BDBM50372450 CHEMBL270740
SMILES: ONC(=O)CCCCCC(=O)N(CC(=O)Nc1ccccc1)CC(=O)Nc1cccc2cccnc12
InChI Key: InChIKey=WJVHKXOFLRSFFU-UHFFFAOYSA-N
Data: 1 IC50
Activity Spreadsheet -- Enzyme Inhibition Constant Data from BindingDB
Found 1 hit for monomerid = 50372450
Trg + Lig
Ki
nM
ΔG°
kcal/mole
IC50
nM
Kd
nM
EC50/IC50
nM
koff
s-1
kon
M-1s-1
pHTemp
°C
Histone deacetylase 1
(Homo sapiens (Human))
BDBM50372450
(CHEMBL270740)
Show SMILES ONC(=O)CCCCCC(=O)N(CC(=O)Nc1ccccc1)CC(=O)Nc1cccc2cccnc12
Show InChI InChI=1S/C26H29N5O5/c32-22(30-36)14-5-2-6-15-25(35)31(17-23(33)28-20-11-3-1-4-12-20)18-24(34)29-21-13-7-9-19-10-8-16-27-26(19)21/h1,3-4,7-13,16,36H,2,5-6,14-15,17-18H2,(H,28,33)(H,29,34)(H,30,32)
NCI pathway
Reactome pathway
n/an/a 25n/an/an/an/an/an/a
Menarini Ricerche
Curated by ChEMBL
Assay Description
Inhibition of human HDAC1
J Med Chem 51: 1505-29 (2008)
Article DOI: 10.1021/jm7011408
BindingDB Entry DOI: 10.7270/Q2M32WMT