BDBM50372459 CHEMBL270962
SMILES: SCC(=S)NCCCCCC(=O)Nc1ccccc1
InChI Key: InChIKey=CBXKYVKKTTWFTM-UHFFFAOYSA-N
Data: 1 IC50
Activity Spreadsheet -- Enzyme Inhibition Constant Data from BindingDB
Found 1 hit for monomerid = 50372459
Trg + Lig
Ki
nM
ΔG°
kcal/mole
IC50
nM
Kd
nM
EC50/IC50
nM
koff
s-1
kon
M-1s-1
pHTemp
°C
Histone deacetylase 8
(Homo sapiens (Human))
BDBM50372459
(CHEMBL270962)
Show SMILES SCC(=S)NCCCCCC(=O)Nc1ccccc1
Show InChI InChI=1S/C14H20N2OS2/c17-13(16-12-7-3-1-4-8-12)9-5-2-6-10-15-14(19)11-18/h1,3-4,7-8,18H,2,5-6,9-11H2,(H,15,19)(H,16,17)
NCI pathway
Reactome pathway
n/an/a>4.00E+4n/an/an/an/an/an/a
Menarini Ricerche
Curated by ChEMBL
Assay Description
Inhibition of human HDAC8
J Med Chem 51: 1505-29 (2008)
Article DOI: 10.1021/jm7011408
BindingDB Entry DOI: 10.7270/Q2M32WMT