BDBM50372467 CHEMBL271102::SB-429201
SMILES: O=C(CCc1ccccc1)Nc1ccc(cc1)C(=O)Nc1ccc(Oc2ccccc2)cc1
InChI Key: InChIKey=YPXLCXVERGDWHW-UHFFFAOYSA-N
Data: 1 IC50
Activity Spreadsheet -- Enzyme Inhibition Constant Data from BindingDB
Found 1 hit for monomerid = 50372467
Trg + Lig
Ki
nM
ΔG°
kcal/mole
IC50
nM
Kd
nM
EC50/IC50
nM
koff
s-1
kon
M-1s-1
pHTemp
°C
Histone deacetylase 1
(Homo sapiens (Human))
BDBM50372467
(CHEMBL271102 | SB-429201)
Show SMILES O=C(CCc1ccccc1)Nc1ccc(cc1)C(=O)Nc1ccc(Oc2ccccc2)cc1
Show InChI InChI=1S/C28H24N2O3/c31-27(20-11-21-7-3-1-4-8-21)29-23-14-12-22(13-15-23)28(32)30-24-16-18-26(19-17-24)33-25-9-5-2-6-10-25/h1-10,12-19H,11,20H2,(H,29,31)(H,30,32)
NCI pathway
Reactome pathway
n/an/a 1.50E+3n/an/an/an/an/an/a
Menarini Ricerche
Curated by ChEMBL
Assay Description
Inhibition of HDAC1
J Med Chem 51: 1505-29 (2008)
Article DOI: 10.1021/jm7011408
BindingDB Entry DOI: 10.7270/Q2M32WMT