BDBM50372591 CHEMBL406680
SMILES: [#7]\[#6](-[#7])=[#7]\[#6]-[#6]-[#6]-[#6@@H]-1-[#7]-[#6](=O)-[#6@@H]-2-[#6]-[#6@H](-[#6]-[#7]-2-[#6](=O)-c2ccccc2)-[#7]-[#6](=O)-[#6@H](-[#6]-[#6](-[#8])=O)-[#7]-[#6](=O)-[#6]-[#7]-[#6]-1=O
InChI Key: InChIKey=UIBGFNHGJUQMPO-QZWWFDLISA-N
Data: 4 IC50
Activity Spreadsheet -- Enzyme Inhibition Constant Data from BindingDB
Found 4 hits for monomerid = 50372591
Trg + Lig
Ki
nM
ΔG°
kcal/mole
IC50
nM
Kd
nM
EC50/IC50
nM
koff
s-1
kon
M-1s-1
pHTemp
°C
ITGAV/ITGB5
(Homo sapiens (Human))
BDBM50372591
(CHEMBL406680)
Show SMILES [#7]\[#6](-[#7])=[#7]\[#6]-[#6]-[#6]-[#6@@H]-1-[#7]-[#6](=O)-[#6@@H]-2-[#6]-[#6@H](-[#6]-[#7]-2-[#6](=O)-c2ccccc2)-[#7]-[#6](=O)-[#6@H](-[#6]-[#6](-[#8])=O)-[#7]-[#6](=O)-[#6]-[#7]-[#6]-1=O
Show InChI InChI=1S/C24H32N8O7/c25-24(26)27-8-4-7-15-20(36)28-11-18(33)30-16(10-19(34)35)21(37)29-14-9-17(22(38)31-15)32(12-14)23(39)13-5-2-1-3-6-13/h1-3,5-6,14-17H,4,7-12H2,(H,28,36)(H,29,37)(H,30,33)(H,31,38)(H,34,35)(H4,25,26,27)/t14-,15+,16+,17+/m1/s1
NCI pathway
Reactome pathway
n/an/a 89.2n/an/an/an/an/an/a
Universit£ di Parma
Curated by ChEMBL
Assay Description
Displacement of [125I]echistatin from human integrin alpha-V-beta-5 receptor by solid phase assay
J Med Chem 51: 1771-82 (2008)
Article DOI: 10.1021/jm701214z
BindingDB Entry DOI: 10.7270/Q29K4C3P
ITGAV/ITGB3
(Homo sapiens (Human))
BDBM50372591
(CHEMBL406680)
Show SMILES [#7]\[#6](-[#7])=[#7]\[#6]-[#6]-[#6]-[#6@@H]-1-[#7]-[#6](=O)-[#6@@H]-2-[#6]-[#6@H](-[#6]-[#7]-2-[#6](=O)-c2ccccc2)-[#7]-[#6](=O)-[#6@H](-[#6]-[#6](-[#8])=O)-[#7]-[#6](=O)-[#6]-[#7]-[#6]-1=O
Show InChI InChI=1S/C24H32N8O7/c25-24(26)27-8-4-7-15-20(36)28-11-18(33)30-16(10-19(34)35)21(37)29-14-9-17(22(38)31-15)32(12-14)23(39)13-5-2-1-3-6-13/h1-3,5-6,14-17H,4,7-12H2,(H,28,36)(H,29,37)(H,30,33)(H,31,38)(H,34,35)(H4,25,26,27)/t14-,15+,16+,17+/m1/s1
n/an/a 327n/an/an/an/an/an/a
Universit£ di Parma
Curated by ChEMBL
Assay Description
Displacement of [125I]echistatin from human integrin alpha-V-beta-3 receptor low affinity state by solid phase assay
J Med Chem 51: 1771-82 (2008)
Article DOI: 10.1021/jm701214z
BindingDB Entry DOI: 10.7270/Q29K4C3P
ITGAV/ITGB3
(Homo sapiens (Human))
BDBM50372591
(CHEMBL406680)
Show SMILES [#7]\[#6](-[#7])=[#7]\[#6]-[#6]-[#6]-[#6@@H]-1-[#7]-[#6](=O)-[#6@@H]-2-[#6]-[#6@H](-[#6]-[#7]-2-[#6](=O)-c2ccccc2)-[#7]-[#6](=O)-[#6@H](-[#6]-[#6](-[#8])=O)-[#7]-[#6](=O)-[#6]-[#7]-[#6]-1=O
Show InChI InChI=1S/C24H32N8O7/c25-24(26)27-8-4-7-15-20(36)28-11-18(33)30-16(10-19(34)35)21(37)29-14-9-17(22(38)31-15)32(12-14)23(39)13-5-2-1-3-6-13/h1-3,5-6,14-17H,4,7-12H2,(H,28,36)(H,29,37)(H,30,33)(H,31,38)(H,34,35)(H4,25,26,27)/t14-,15+,16+,17+/m1/s1
n/an/a 0.910n/an/an/an/an/an/a
Universit£ di Parma
Curated by ChEMBL
Assay Description
Displacement of [125I]echistatin from human integrin alpha-V-beta-3 receptor high affinity state by solid phase assay
J Med Chem 51: 1771-82 (2008)
Article DOI: 10.1021/jm701214z
BindingDB Entry DOI: 10.7270/Q29K4C3P
ITGAV/ITGB3
(Homo sapiens (Human))
BDBM50372591
(CHEMBL406680)
Show SMILES [#7]\[#6](-[#7])=[#7]\[#6]-[#6]-[#6]-[#6@@H]-1-[#7]-[#6](=O)-[#6@@H]-2-[#6]-[#6@H](-[#6]-[#7]-2-[#6](=O)-c2ccccc2)-[#7]-[#6](=O)-[#6@H](-[#6]-[#6](-[#8])=O)-[#7]-[#6](=O)-[#6]-[#7]-[#6]-1=O
Show InChI InChI=1S/C24H32N8O7/c25-24(26)27-8-4-7-15-20(36)28-11-18(33)30-16(10-19(34)35)21(37)29-14-9-17(22(38)31-15)32(12-14)23(39)13-5-2-1-3-6-13/h1-3,5-6,14-17H,4,7-12H2,(H,28,36)(H,29,37)(H,30,33)(H,31,38)(H,34,35)(H4,25,26,27)/t14-,15+,16+,17+/m1/s1
n/an/a 174n/an/an/an/an/an/a
Universit£ di Parma
Curated by ChEMBL
Assay Description
Displacement of [125I]echistatin from human integrin alpha-V-beta-3 receptor by solid phase assay
J Med Chem 51: 1771-82 (2008)
Article DOI: 10.1021/jm701214z
BindingDB Entry DOI: 10.7270/Q29K4C3P