BDBM50372712 CHEMBL271099
SMILES: CNc1ncc(C(=O)Nc2cc(ccc2C)C(=O)Nc2cccc(c2)C(F)(F)F)c(Oc2ccccc2)n1
InChI Key: InChIKey=GSKDHAVJCUTIGZ-UHFFFAOYSA-N
Data: 4 IC50
Activity Spreadsheet -- Enzyme Inhibition Constant Data from BindingDB
Found 4 hits for monomerid = 50372712
Trg + Lig
Ki
nM
ΔG°
kcal/mole
IC50
nM
Kd
nM
EC50/IC50
nM
koff
s-1
kon
M-1s-1
pHTemp
°C
Angiopoietin-1 receptor
(Homo sapiens (Human))
BDBM50372712
(CHEMBL271099)
Show SMILES CNc1ncc(C(=O)Nc2cc(ccc2C)C(=O)Nc2cccc(c2)C(F)(F)F)c(Oc2ccccc2)n1
Show InChI InChI=1S/C27H22F3N5O3/c1-16-11-12-17(23(36)33-19-8-6-7-18(14-19)27(28,29)30)13-22(16)34-24(37)21-15-32-26(31-2)35-25(21)38-20-9-4-3-5-10-20/h3-15H,1-2H3,(H,33,36)(H,34,37)(H,31,32,35)
n/an/a>2.50E+4n/an/an/an/an/an/a
Amgen Inc.
Curated by ChEMBL
Assay Description
Inhibition of Tie2
Bioorg Med Chem Lett 18: 1172-6 (2008)
Article DOI: 10.1016/j.bmcl.2007.11.123
BindingDB Entry DOI: 10.7270/Q2WD41FK
Tyrosine-protein kinase JAK3
(Homo sapiens (Human))
BDBM50372712
(CHEMBL271099)
Show SMILES CNc1ncc(C(=O)Nc2cc(ccc2C)C(=O)Nc2cccc(c2)C(F)(F)F)c(Oc2ccccc2)n1
Show InChI InChI=1S/C27H22F3N5O3/c1-16-11-12-17(23(36)33-19-8-6-7-18(14-19)27(28,29)30)13-22(16)34-24(37)21-15-32-26(31-2)35-25(21)38-20-9-4-3-5-10-20/h3-15H,1-2H3,(H,33,36)(H,34,37)(H,31,32,35)
Reactome pathway
n/an/a>2.50E+4n/an/an/an/an/an/a
Amgen Inc.
Curated by ChEMBL
Assay Description
Inhibition of Jak3
Bioorg Med Chem Lett 18: 1172-6 (2008)
Article DOI: 10.1016/j.bmcl.2007.11.123
BindingDB Entry DOI: 10.7270/Q2WD41FK
Vascular endothelial growth factor receptor 2
(Homo sapiens (Human))
BDBM50372712
(CHEMBL271099)
Show SMILES CNc1ncc(C(=O)Nc2cc(ccc2C)C(=O)Nc2cccc(c2)C(F)(F)F)c(Oc2ccccc2)n1
Show InChI InChI=1S/C27H22F3N5O3/c1-16-11-12-17(23(36)33-19-8-6-7-18(14-19)27(28,29)30)13-22(16)34-24(37)21-15-32-26(31-2)35-25(21)38-20-9-4-3-5-10-20/h3-15H,1-2H3,(H,33,36)(H,34,37)(H,31,32,35)
NCI pathway
Reactome pathway
n/an/a>2.50E+4n/an/an/an/an/an/a
Amgen Inc.
Curated by ChEMBL
Assay Description
Inhibition of KDR
Bioorg Med Chem Lett 18: 1172-6 (2008)
Article DOI: 10.1016/j.bmcl.2007.11.123
BindingDB Entry DOI: 10.7270/Q2WD41FK
Tyrosine-protein kinase Lck
(Homo sapiens (Human))
BDBM50372712
(CHEMBL271099)
Show SMILES CNc1ncc(C(=O)Nc2cc(ccc2C)C(=O)Nc2cccc(c2)C(F)(F)F)c(Oc2ccccc2)n1
Show InChI InChI=1S/C27H22F3N5O3/c1-16-11-12-17(23(36)33-19-8-6-7-18(14-19)27(28,29)30)13-22(16)34-24(37)21-15-32-26(31-2)35-25(21)38-20-9-4-3-5-10-20/h3-15H,1-2H3,(H,33,36)(H,34,37)(H,31,32,35)
n/an/a 25n/an/an/an/an/an/a
Amgen Inc.
Curated by ChEMBL
Assay Description
Inhibition of Lck by HTRF assay
Bioorg Med Chem Lett 18: 1172-6 (2008)
Article DOI: 10.1016/j.bmcl.2007.11.123
BindingDB Entry DOI: 10.7270/Q2WD41FK