BDBM50372763 CHEMBL272377
SMILES: O=C(Nc1ccc(cc1)C1CCCCC1)C1C(=O)NC(C1=O)c1ccccc1
InChI Key: InChIKey=KKFAZDRIVMMEAQ-UHFFFAOYSA-N
Data: 2 IC50
Activity Spreadsheet -- Enzyme Inhibition Constant Data from BindingDB
Found 2 hits for monomerid = 50372763
Trg + Lig
Ki
nM
ΔG°
kcal/mole
IC50
nM
Kd
nM
EC50/IC50
nM
koff
s-1
kon
M-1s-1
pHTemp
°C
Undecaprenyl pyrophosphate synthase
(Streptococcus pneumoniae)
BDBM50372763
(CHEMBL272377)
Show SMILES O=C(Nc1ccc(cc1)C1CCCCC1)C1C(=O)NC(C1=O)c1ccccc1
Show InChI InChI=1S/C23H24N2O3/c26-21-19(23(28)25-20(21)17-9-5-2-6-10-17)22(27)24-18-13-11-16(12-14-18)15-7-3-1-4-8-15/h2,5-6,9-15,19-20H,1,3-4,7-8H2,(H,24,27)(H,25,28)
n/an/a 3.50E+3n/an/an/an/an/an/a
Novartis Institutes for BioMedical Research
Curated by ChEMBL
Assay Description
Inhibition of Streptococcus pneumoniae UPPS
Bioorg Med Chem Lett 18: 1840-4 (2008)
Article DOI: 10.1016/j.bmcl.2008.02.009
BindingDB Entry DOI: 10.7270/Q2CF9QZ5
Farnesyl diphosphate synthase
(Homo sapiens (Human))
BDBM50372763
(CHEMBL272377)
Show SMILES O=C(Nc1ccc(cc1)C1CCCCC1)C1C(=O)NC(C1=O)c1ccccc1
Show InChI InChI=1S/C23H24N2O3/c26-21-19(23(28)25-20(21)17-9-5-2-6-10-17)22(27)24-18-13-11-16(12-14-18)15-7-3-1-4-8-15/h2,5-6,9-15,19-20H,1,3-4,7-8H2,(H,24,27)(H,25,28)
Reactome pathway
n/an/a>1.00E+5n/an/an/an/an/an/a
Novartis Institutes for BioMedical Research
Curated by ChEMBL
Assay Description
Inhibition of human FPPS
Bioorg Med Chem Lett 18: 1840-4 (2008)
Article DOI: 10.1016/j.bmcl.2008.02.009
BindingDB Entry DOI: 10.7270/Q2CF9QZ5