BDBM50372774 CHEMBL270170
SMILES: Fc1ccc(NC(=O)C2C(=O)NC(CCc3ccccc3)C2=O)cc1
InChI Key: InChIKey=CUJTWRMMQPDVQF-UHFFFAOYSA-N
Data: 1 IC50
Activity Spreadsheet -- Enzyme Inhibition Constant Data from BindingDB
Found 1 hit for monomerid = 50372774
Trg + Lig
Ki
nM
ΔG°
kcal/mole
IC50
nM
Kd
nM
EC50/IC50
nM
koff
s-1
kon
M-1s-1
pHTemp
°C
Undecaprenyl pyrophosphate synthase
(Streptococcus pneumoniae)
BDBM50372774
(CHEMBL270170)
Show SMILES Fc1ccc(NC(=O)C2C(=O)NC(CCc3ccccc3)C2=O)cc1
Show InChI InChI=1S/C19H17FN2O3/c20-13-7-9-14(10-8-13)21-18(24)16-17(23)15(22-19(16)25)11-6-12-4-2-1-3-5-12/h1-5,7-10,15-16H,6,11H2,(H,21,24)(H,22,25)
n/an/a 2.50E+3n/an/an/an/an/an/a
Novartis Institutes for BioMedical Research
Curated by ChEMBL
Assay Description
Inhibition of Streptococcus pneumoniae UPPS
Bioorg Med Chem Lett 18: 1840-4 (2008)
Article DOI: 10.1016/j.bmcl.2008.02.009
BindingDB Entry DOI: 10.7270/Q2CF9QZ5