BDBM50372775 CHEMBL257947
SMILES: COCC1NC(=O)C(C(=O)Nc2ccc(cc2)C2CCCCC2)C1=O
InChI Key: InChIKey=DHOFOEWETVBVCF-UHFFFAOYSA-N
Data: 1 IC50
Activity Spreadsheet -- Enzyme Inhibition Constant Data from BindingDB
Found 1 hit for monomerid = 50372775
Trg + Lig
Ki
nM
ΔG°
kcal/mole
IC50
nM
Kd
nM
EC50/IC50
nM
koff
s-1
kon
M-1s-1
pHTemp
°C
Undecaprenyl pyrophosphate synthase
(Streptococcus pneumoniae)
BDBM50372775
(CHEMBL257947)
Show SMILES COCC1NC(=O)C(C(=O)Nc2ccc(cc2)C2CCCCC2)C1=O
Show InChI InChI=1S/C19H24N2O4/c1-25-11-15-17(22)16(19(24)21-15)18(23)20-14-9-7-13(8-10-14)12-5-3-2-4-6-12/h7-10,12,15-16H,2-6,11H2,1H3,(H,20,23)(H,21,24)
n/an/a>5.00E+4n/an/an/an/an/an/a
Novartis Institutes for BioMedical Research
Curated by ChEMBL
Assay Description
Inhibition of Streptococcus pneumoniae UPPS
Bioorg Med Chem Lett 18: 1840-4 (2008)
Article DOI: 10.1016/j.bmcl.2008.02.009
BindingDB Entry DOI: 10.7270/Q2CF9QZ5