BDBM50372968 CHEMBL271220
SMILES: CCOC[C@@]12CN(CCC1=Cc1c(C2)cnn1-c1ccc(F)cc1)S(=O)(=O)c1ccc(cc1)C(F)(F)F
InChI Key: InChIKey=SLKURXRZHJOZOD-RUZDIDTESA-N
Data: 3 KI  1 IC50
Activity Spreadsheet -- Enzyme Inhibition Constant Data from BindingDB
Found 4 hits for monomerid = 50372968
Trg + Lig
Ki
nM
ΔG°
kcal/mole
IC50
nM
Kd
nM
EC50/IC50
nM
koff
s-1
kon
M-1s-1
pHTemp
°C
Glucocorticoid receptor
(Homo sapiens (Human))
BDBM50372968
(CHEMBL271220)
Show SMILES CCOC[C@@]12CN(CCC1=Cc1c(C2)cnn1-c1ccc(F)cc1)S(=O)(=O)c1ccc(cc1)C(F)(F)F |c:10|
Show InChI InChI=1S/C26H25F4N3O3S/c1-2-36-17-25-14-18-15-31-33(22-7-5-21(27)6-8-22)24(18)13-20(25)11-12-32(16-25)37(34,35)23-9-3-19(4-10-23)26(28,29)30/h3-10,13,15H,2,11-12,14,16-17H2,1H3/t25-/m1/s1
0.900n/an/an/an/an/an/an/an/a
Corcept Therapeutics
Curated by ChEMBL
Assay Description
Displacement of [3H]dexamethasone from human recombinant GR
Bioorg Med Chem Lett 18: 1312-7 (2008)
Article DOI: 10.1016/j.bmcl.2008.01.027
BindingDB Entry DOI: 10.7270/Q22Z16CP
Glucocorticoid receptor
(Homo sapiens (Human))
BDBM50372968
(CHEMBL271220)
Show SMILES CCOC[C@@]12CN(CCC1=Cc1c(C2)cnn1-c1ccc(F)cc1)S(=O)(=O)c1ccc(cc1)C(F)(F)F |c:10|
Show InChI InChI=1S/C26H25F4N3O3S/c1-2-36-17-25-14-18-15-31-33(22-7-5-21(27)6-8-22)24(18)13-20(25)11-12-32(16-25)37(34,35)23-9-3-19(4-10-23)26(28,29)30/h3-10,13,15H,2,11-12,14,16-17H2,1H3/t25-/m1/s1
6.80n/an/an/an/an/an/an/an/a
Corcept Therapeutics
Curated by ChEMBL
Assay Description
Binding affinity to glucocorticoid receptor (unknown origin) by reporter gene assay
Bioorg Med Chem Lett 25: 5720-5 (2015)
Article DOI: 10.1016/j.bmcl.2015.10.097
BindingDB Entry DOI: 10.7270/Q2ST7STZ
Glucocorticoid receptor
(Homo sapiens (Human))
BDBM50372968
(CHEMBL271220)
Show SMILES CCOC[C@@]12CN(CCC1=Cc1c(C2)cnn1-c1ccc(F)cc1)S(=O)(=O)c1ccc(cc1)C(F)(F)F |c:10|
Show InChI InChI=1S/C26H25F4N3O3S/c1-2-36-17-25-14-18-15-31-33(22-7-5-21(27)6-8-22)24(18)13-20(25)11-12-32(16-25)37(34,35)23-9-3-19(4-10-23)26(28,29)30/h3-10,13,15H,2,11-12,14,16-17H2,1H3/t25-/m1/s1
6.80n/an/an/an/an/an/an/an/a
Corcept Therapeutics
Curated by ChEMBL
Assay Description
Antagonist activity at GR in SW1353/MMTV5 cells assessed as inhibition of dexamethasone-induced luciferase expression
Bioorg Med Chem Lett 18: 1312-7 (2008)
Article DOI: 10.1016/j.bmcl.2008.01.027
BindingDB Entry DOI: 10.7270/Q22Z16CP
1,3-beta-glucan synthase component GLS2
(Saccharomyces cerevisiae)
BDBM50372968
(CHEMBL271220)
Show SMILES CCOC[C@@]12CN(CCC1=Cc1c(C2)cnn1-c1ccc(F)cc1)S(=O)(=O)c1ccc(cc1)C(F)(F)F |c:10|
Show InChI InChI=1S/C26H25F4N3O3S/c1-2-36-17-25-14-18-15-31-33(22-7-5-21(27)6-8-22)24(18)13-20(25)11-12-32(16-25)37(34,35)23-9-3-19(4-10-23)26(28,29)30/h3-10,13,15H,2,11-12,14,16-17H2,1H3/t25-/m1/s1
n/an/a 800n/an/an/an/an/an/a
Corcept Therapeutics
Curated by ChEMBL
Assay Description
Inhibition of human ERG by patch clamp technique
Bioorg Med Chem Lett 25: 5720-5 (2015)
Article DOI: 10.1016/j.bmcl.2015.10.097
BindingDB Entry DOI: 10.7270/Q2ST7STZ