BDBM50372987 CHEMBL258255
SMILES: Cn1ncc(-c2ccc(cc2)S(C)(=O)=O)c(-c2ccc(C[C@H](NC(=O)c3c(Cl)cccc3Cl)C(O)=O)cc2)c1=O
InChI Key: InChIKey=YOUZAJBMSLTNRU-QHCPKHFHSA-N
Data: 2 IC50
Activity Spreadsheet -- Enzyme Inhibition Constant Data from BindingDB
Found 2 hits for monomerid = 50372987
Trg + Lig
Ki
nM
ΔG°
kcal/mole
IC50
nM
Kd
nM
EC50/IC50
nM
koff
s-1
kon
M-1s-1
pHTemp
°C
Fibronectin receptor beta/Integrin alpha-4
(Homo sapiens (Human))
BDBM50372987
(CHEMBL258255)
Show SMILES Cn1ncc(-c2ccc(cc2)S(C)(=O)=O)c(-c2ccc(C[C@H](NC(=O)c3c(Cl)cccc3Cl)C(O)=O)cc2)c1=O
Show InChI InChI=1S/C28H23Cl2N3O6S/c1-33-27(35)24(20(15-31-33)17-10-12-19(13-11-17)40(2,38)39)18-8-6-16(7-9-18)14-23(28(36)37)32-26(34)25-21(29)4-3-5-22(25)30/h3-13,15,23H,14H2,1-2H3,(H,32,34)(H,36,37)/t23-/m0/s1
Reactome pathway
n/an/a 150n/an/an/an/an/an/a
Johnson& Johnson Pharmaceutical Research& Development
Curated by ChEMBL
Assay Description
Inhibition of human integrin alpha-4-beta-1-mediated Ramos cell adhesion to immobilized VCAM1
Bioorg Med Chem Lett 18: 1331-5 (2008)
Article DOI: 10.1016/j.bmcl.2008.01.022
BindingDB Entry DOI: 10.7270/Q2TD9Z6W
Integrin α4β7
(Homo sapiens (Human))
BDBM50372987
(CHEMBL258255)
Show SMILES Cn1ncc(-c2ccc(cc2)S(C)(=O)=O)c(-c2ccc(C[C@H](NC(=O)c3c(Cl)cccc3Cl)C(O)=O)cc2)c1=O
Show InChI InChI=1S/C28H23Cl2N3O6S/c1-33-27(35)24(20(15-31-33)17-10-12-19(13-11-17)40(2,38)39)18-8-6-16(7-9-18)14-23(28(36)37)32-26(34)25-21(29)4-3-5-22(25)30/h3-13,15,23H,14H2,1-2H3,(H,32,34)(H,36,37)/t23-/m0/s1
NCI pathway
Reactome pathway
n/an/a 2n/an/an/an/an/an/a
Johnson& Johnson Pharmaceutical Research& Development
Curated by ChEMBL
Assay Description
Inhibition of human integrin alpha-4-beta-7-mediated K562 cell adhesion to immobilized MAdCAM1
Bioorg Med Chem Lett 18: 1331-5 (2008)
Article DOI: 10.1016/j.bmcl.2008.01.022
BindingDB Entry DOI: 10.7270/Q2TD9Z6W