BDBM50373002 CHEMBL272966
SMILES: Cn1ncc(-c2ccc3OCOc3c2)c(-c2ccc(C[C@H](NC(=O)c3c(Cl)cccc3Cl)C(O)=O)cc2)c1=O
InChI Key: InChIKey=PSWUVNHTPHGXNB-NRFANRHFSA-N
Data: 2 IC50
Activity Spreadsheet -- Enzyme Inhibition Constant Data from BindingDB
Found 2 hits for monomerid = 50373002
Trg + Lig
Ki
nM
ΔG°
kcal/mole
IC50
nM
Kd
nM
EC50/IC50
nM
koff
s-1
kon
M-1s-1
pHTemp
°C
Fibronectin receptor beta/Integrin alpha-4
(Homo sapiens (Human))
BDBM50373002
(CHEMBL272966)
Show SMILES Cn1ncc(-c2ccc3OCOc3c2)c(-c2ccc(C[C@H](NC(=O)c3c(Cl)cccc3Cl)C(O)=O)cc2)c1=O
Show InChI InChI=1S/C28H21Cl2N3O6/c1-33-27(35)24(18(13-31-33)17-9-10-22-23(12-17)39-14-38-22)16-7-5-15(6-8-16)11-21(28(36)37)32-26(34)25-19(29)3-2-4-20(25)30/h2-10,12-13,21H,11,14H2,1H3,(H,32,34)(H,36,37)/t21-/m0/s1
Reactome pathway
n/an/a 400n/an/an/an/an/an/a
Johnson& Johnson Pharmaceutical Research& Development
Curated by ChEMBL
Assay Description
Inhibition of human integrin alpha-4-beta-1-mediated Ramos cell adhesion to immobilized VCAM1
Bioorg Med Chem Lett 18: 1331-5 (2008)
Article DOI: 10.1016/j.bmcl.2008.01.022
BindingDB Entry DOI: 10.7270/Q2TD9Z6W
Integrin α4β7
(Homo sapiens (Human))
BDBM50373002
(CHEMBL272966)
Show SMILES Cn1ncc(-c2ccc3OCOc3c2)c(-c2ccc(C[C@H](NC(=O)c3c(Cl)cccc3Cl)C(O)=O)cc2)c1=O
Show InChI InChI=1S/C28H21Cl2N3O6/c1-33-27(35)24(18(13-31-33)17-9-10-22-23(12-17)39-14-38-22)16-7-5-15(6-8-16)11-21(28(36)37)32-26(34)25-19(29)3-2-4-20(25)30/h2-10,12-13,21H,11,14H2,1H3,(H,32,34)(H,36,37)/t21-/m0/s1
NCI pathway
Reactome pathway
n/an/a 5n/an/an/an/an/an/a
Johnson& Johnson Pharmaceutical Research& Development
Curated by ChEMBL
Assay Description
Inhibition of human integrin alpha-4-beta-7-mediated K562 cell adhesion to immobilized MAdCAM1
Bioorg Med Chem Lett 18: 1331-5 (2008)
Article DOI: 10.1016/j.bmcl.2008.01.022
BindingDB Entry DOI: 10.7270/Q2TD9Z6W