BDBM50373008 CHEMBL402318
SMILES: CCc1cnn(C)c(=O)c1-c1ccc(C[C@H](NC(=O)c2c(Cl)cccc2Cl)C(O)=O)cc1
InChI Key: InChIKey=WJGBWZYBCVVZMH-SFHVURJKSA-N
Data: 2 IC50
Activity Spreadsheet -- Enzyme Inhibition Constant Data from BindingDB
Found 2 hits for monomerid = 50373008
Trg + Lig
Ki
nM
ΔG°
kcal/mole
IC50
nM
Kd
nM
EC50/IC50
nM
koff
s-1
kon
M-1s-1
pHTemp
°C
Fibronectin receptor beta/Integrin alpha-4
(Homo sapiens (Human))
BDBM50373008
(CHEMBL402318)
Show SMILES CCc1cnn(C)c(=O)c1-c1ccc(C[C@H](NC(=O)c2c(Cl)cccc2Cl)C(O)=O)cc1
Show InChI InChI=1S/C23H21Cl2N3O4/c1-3-14-12-26-28(2)22(30)19(14)15-9-7-13(8-10-15)11-18(23(31)32)27-21(29)20-16(24)5-4-6-17(20)25/h4-10,12,18H,3,11H2,1-2H3,(H,27,29)(H,31,32)/t18-/m0/s1
Reactome pathway
n/an/a>5.00E+3n/an/an/an/an/an/a
Johnson& Johnson Pharmaceutical Research& Development
Curated by ChEMBL
Assay Description
Inhibition of human integrin alpha-4-beta-1-mediated Ramos cell adhesion to immobilized VCAM1
Bioorg Med Chem Lett 18: 1331-5 (2008)
Article DOI: 10.1016/j.bmcl.2008.01.022
BindingDB Entry DOI: 10.7270/Q2TD9Z6W
Integrin α4β7
(Homo sapiens (Human))
BDBM50373008
(CHEMBL402318)
Show SMILES CCc1cnn(C)c(=O)c1-c1ccc(C[C@H](NC(=O)c2c(Cl)cccc2Cl)C(O)=O)cc1
Show InChI InChI=1S/C23H21Cl2N3O4/c1-3-14-12-26-28(2)22(30)19(14)15-9-7-13(8-10-15)11-18(23(31)32)27-21(29)20-16(24)5-4-6-17(20)25/h4-10,12,18H,3,11H2,1-2H3,(H,27,29)(H,31,32)/t18-/m0/s1
NCI pathway
Reactome pathway
n/an/a 61n/an/an/an/an/an/a
Johnson& Johnson Pharmaceutical Research& Development
Curated by ChEMBL
Assay Description
Inhibition of human integrin alpha-4-beta-7-mediated K562 cell adhesion to immobilized MAdCAM1
Bioorg Med Chem Lett 18: 1331-5 (2008)
Article DOI: 10.1016/j.bmcl.2008.01.022
BindingDB Entry DOI: 10.7270/Q2TD9Z6W