BDBM50373009 CHEMBL270191
SMILES: Cn1nccc(-c2ccc(C[C@H](NC(=O)c3c(Cl)cccc3Cl)C(O)=O)cc2)c1=O
InChI Key: InChIKey=FPRXGNGLIQZNBP-KRWDZBQOSA-N
Data: 2 IC50
Activity Spreadsheet -- Enzyme Inhibition Constant Data from BindingDB
Found 2 hits for monomerid = 50373009
Trg + Lig
Ki
nM
ΔG°
kcal/mole
IC50
nM
Kd
nM
EC50/IC50
nM
koff
s-1
kon
M-1s-1
pHTemp
°C
Fibronectin receptor beta/Integrin alpha-4
(Homo sapiens (Human))
BDBM50373009
(CHEMBL270191)
Show SMILES Cn1nccc(-c2ccc(C[C@H](NC(=O)c3c(Cl)cccc3Cl)C(O)=O)cc2)c1=O
Show InChI InChI=1S/C21H17Cl2N3O4/c1-26-20(28)14(9-10-24-26)13-7-5-12(6-8-13)11-17(21(29)30)25-19(27)18-15(22)3-2-4-16(18)23/h2-10,17H,11H2,1H3,(H,25,27)(H,29,30)/t17-/m0/s1
Reactome pathway
n/an/a>1.00E+3n/an/an/an/an/an/a
Johnson& Johnson Pharmaceutical Research& Development
Curated by ChEMBL
Assay Description
Inhibition of human integrin alpha-4-beta-1-mediated Ramos cell adhesion to immobilized VCAM1
Bioorg Med Chem Lett 18: 1331-5 (2008)
Article DOI: 10.1016/j.bmcl.2008.01.022
BindingDB Entry DOI: 10.7270/Q2TD9Z6W
Integrin α4β7
(Homo sapiens (Human))
BDBM50373009
(CHEMBL270191)
Show SMILES Cn1nccc(-c2ccc(C[C@H](NC(=O)c3c(Cl)cccc3Cl)C(O)=O)cc2)c1=O
Show InChI InChI=1S/C21H17Cl2N3O4/c1-26-20(28)14(9-10-24-26)13-7-5-12(6-8-13)11-17(21(29)30)25-19(27)18-15(22)3-2-4-16(18)23/h2-10,17H,11H2,1H3,(H,25,27)(H,29,30)/t17-/m0/s1
NCI pathway
Reactome pathway
n/an/a 360n/an/an/an/an/an/a
Johnson& Johnson Pharmaceutical Research& Development
Curated by ChEMBL
Assay Description
Inhibition of human integrin alpha-4-beta-7-mediated K562 cell adhesion to immobilized MAdCAM1
Bioorg Med Chem Lett 18: 1331-5 (2008)
Article DOI: 10.1016/j.bmcl.2008.01.022
BindingDB Entry DOI: 10.7270/Q2TD9Z6W