BDBM50373047 CHEMBL260235
SMILES: CCCCNC(=O)NC1CCOC1=O
InChI Key: InChIKey=GBDAILLUNRESCX-UHFFFAOYSA-N
Data: 1 IC50
Activity Spreadsheet -- Enzyme Inhibition Constant Data from BindingDB
Found 1 hit for monomerid = 50373047
Trg + Lig
Ki
nM
ΔG°
kcal/mole
IC50
nM
Kd
nM
EC50/IC50
nM
koff
s-1
kon
M-1s-1
pHTemp
°C
Transcriptional activator protein luxR
(Vibrio fischeri)
BDBM50373047
(CHEMBL260235)
Show SMILES CCCCNC(=O)NC1CCOC1=O
Show InChI InChI=1S/C9H16N2O3/c1-2-3-5-10-9(13)11-7-4-6-14-8(7)12/h7H,2-6H2,1H3,(H2,10,11,13)
n/an/a 5.00E+3n/an/an/an/an/an/a
INSA Lyon
Curated by ChEMBL
Assay Description
Antagonist activity at LuxR in Vibrio fischeri assessed as inhibition of N-3-oxos-hexanoyl-L-homoserine lactone induced luminescence
Bioorg Med Chem 16: 3550-6 (2008)
Article DOI: 10.1016/j.bmc.2008.02.023
BindingDB Entry DOI: 10.7270/Q2X63NTT