BDBM50373054 CHEMBL408296
SMILES: CCCCCCCCNS(=O)(=O)NC1CCOC1=O
InChI Key: InChIKey=ROLJQVHWYDKSAF-UHFFFAOYSA-N
Data: 1 IC50
Activity Spreadsheet -- Enzyme Inhibition Constant Data from BindingDB
Found 1 hit for monomerid = 50373054
Trg + Lig
Ki
nM
ΔG°
kcal/mole
IC50
nM
Kd
nM
EC50/IC50
nM
koff
s-1
kon
M-1s-1
pHTemp
°C
Transcriptional activator protein luxR
(Vibrio fischeri)
BDBM50373054
(CHEMBL408296)
Show SMILES CCCCCCCCNS(=O)(=O)NC1CCOC1=O
Show InChI InChI=1S/C12H24N2O4S/c1-2-3-4-5-6-7-9-13-19(16,17)14-11-8-10-18-12(11)15/h11,13-14H,2-10H2,1H3
n/an/a 7.20E+3n/an/an/an/an/an/a
INSA Lyon
Curated by ChEMBL
Assay Description
Antagonist activity at LuxR in Vibrio fischeri assessed as inhibition of N-3-oxos-hexanoyl-L-homoserine lactone induced luminescence
Bioorg Med Chem 16: 3550-6 (2008)
Article DOI: 10.1016/j.bmc.2008.02.023
BindingDB Entry DOI: 10.7270/Q2X63NTT