null
SMILES: CC(C)(C)C1CCc2onc(C(=O)Nc3cnn(Cc4ccc(Cl)cc4)c3)c2C1
InChI Key: InChIKey=IADSDBJTSWKJGC-UHFFFAOYSA-N
Activity Spreadsheet -- Enzyme Inhibition Constant Data from BindingDB
Found 1 hit for monomerid = 50373144
Trg + Lig
Ki
nM
ΔG°
kcal/mole
IC50
nM
Kd
nM
EC50/IC50
nM
koff
s-1
kon
M-1s-1
pHTemp
°C
Pantothenate synthetase
(Mycobacterium tuberculosis (strain ATCC 25618 / H3...)
BDBM50373144
(CHEMBL258966)
Show SMILES CC(C)(C)C1CCc2onc(C(=O)Nc3cnn(Cc4ccc(Cl)cc4)c3)c2C1 |w:4.3|
Show InChI InChI=1S/C22H25ClN4O2/c1-22(2,3)15-6-9-19-18(10-15)20(26-29-19)21(28)25-17-11-24-27(13-17)12-14-4-7-16(23)8-5-14/h4-5,7-8,11,13,15H,6,9-10,12H2,1-3H3,(H,25,28)
n/an/a 140n/an/an/an/an/an/a
University of Illinois at Chicago
Curated by ChEMBL
Assay Description
Inhibition of Mycobacterium tuberculosis pantothenate synthetase
J Med Chem 51: 1999-2002 (2008)
Article DOI: 10.1021/jm701372r
BindingDB Entry DOI: 10.7270/Q2028SD7