BDBM50373216 CHEMBL259404
SMILES: COC(=O)c1c(-c2ccccc2)c2ccccc2c(=O)n1Cc1ccc(cc1)S(C)(=O)=O
InChI Key: InChIKey=YAQGZXCLYCWIEO-UHFFFAOYSA-N
Data: 1 IC50
Activity Spreadsheet -- Enzyme Inhibition Constant Data from BindingDB
Found 1 hit for monomerid = 50373216
Trg + Lig
Ki
nM
ΔG°
kcal/mole
IC50
nM
Kd
nM
EC50/IC50
nM
koff
s-1
kon
M-1s-1
pHTemp
°C
Mitogen-activated protein kinase 8
(Homo sapiens (Human))
BDBM50373216
(CHEMBL259404)
Show SMILES COC(=O)c1c(-c2ccccc2)c2ccccc2c(=O)n1Cc1ccc(cc1)S(C)(=O)=O
Show InChI InChI=1S/C25H21NO5S/c1-31-25(28)23-22(18-8-4-3-5-9-18)20-10-6-7-11-21(20)24(27)26(23)16-17-12-14-19(15-13-17)32(2,29)30/h3-15H,16H2,1-2H3
NCI pathway
Reactome pathway
n/an/a 59n/an/an/an/an/an/a
Takeda Pharmaceutical Company, Ltd
Curated by ChEMBL
Assay Description
Inhibition of human JNK1 by radiometric assay
Bioorg Med Chem 16: 4715-32 (2008)
Article DOI: 10.1016/j.bmc.2008.02.027
BindingDB Entry DOI: 10.7270/Q2JS9R8M