BDBM50373219 CHEMBL260126
SMILES: COC(=O)c1cccc(Cn2c(C(=O)OC)c(-c3ccccc3)c3cc(Br)ccc3c2=O)c1
InChI Key: InChIKey=ZBOUSOMNRVCTQL-UHFFFAOYSA-N
Data: 1 IC50
Activity Spreadsheet -- Enzyme Inhibition Constant Data from BindingDB
Found 1 hit for monomerid = 50373219
Trg + Lig
Ki
nM
ΔG°
kcal/mole
IC50
nM
Kd
nM
EC50/IC50
nM
koff
s-1
kon
M-1s-1
pHTemp
°C
Mitogen-activated protein kinase 8
(Homo sapiens (Human))
BDBM50373219
(CHEMBL260126)
Show SMILES COC(=O)c1cccc(Cn2c(C(=O)OC)c(-c3ccccc3)c3cc(Br)ccc3c2=O)c1
Show InChI InChI=1S/C26H20BrNO5/c1-32-25(30)18-10-6-7-16(13-18)15-28-23(26(31)33-2)22(17-8-4-3-5-9-17)21-14-19(27)11-12-20(21)24(28)29/h3-14H,15H2,1-2H3
NCI pathway
Reactome pathway
n/an/a 89n/an/an/an/an/an/a
Takeda Pharmaceutical Company, Ltd
Curated by ChEMBL
Assay Description
Inhibition of human JNK1 by radiometric assay
Bioorg Med Chem 16: 4715-32 (2008)
Article DOI: 10.1016/j.bmc.2008.02.027
BindingDB Entry DOI: 10.7270/Q2JS9R8M