BDBM50373351 CHEMBL408149
SMILES: CCCCCCc1ccc(Oc2ccccc2CN2CCN(C)CC2)c(O)c1
InChI Key: InChIKey=GZYYBRGLRLTAQS-UHFFFAOYSA-N
Data: 2 IC50
Activity Spreadsheet -- Enzyme Inhibition Constant Data from BindingDB
Found 2 hits for monomerid = 50373351
Trg + Lig
Ki
nM
ΔG°
kcal/mole
IC50
nM
Kd
nM
EC50/IC50
nM
koff
s-1
kon
M-1s-1
pHTemp
°C
Enoyl-[acyl-carrier-protein] reductase [NADH]
(Mycobacterium tuberculosis (strain ATCC 25618 / H3...)
BDBM50373351
(CHEMBL408149)
Show SMILES CCCCCCc1ccc(Oc2ccccc2CN2CCN(C)CC2)c(O)c1
Show InChI InChI=1S/C24H34N2O2/c1-3-4-5-6-9-20-12-13-24(22(27)18-20)28-23-11-8-7-10-21(23)19-26-16-14-25(2)15-17-26/h7-8,10-13,18,27H,3-6,9,14-17,19H2,1-2H3
n/an/a 7.62E+5n/an/an/an/an/an/a
TBA
Assay Description
Inhibition of Mycobacterium tuberculosis InhA
Citation and Details
Article DOI: 10.1007/s00044-010-9518-8
BindingDB Entry DOI: 10.7270/Q2MG7SC4
Enoyl-ACP Reductase (InhA)
(Mycobacterium tuberculosis (strain ATCC 25618 / H3...)
BDBM50373351
(CHEMBL408149)
Show SMILES CCCCCCc1ccc(Oc2ccccc2CN2CCN(C)CC2)c(O)c1
Show InChI InChI=1S/C24H34N2O2/c1-3-4-5-6-9-20-12-13-24(22(27)18-20)28-23-11-8-7-10-21(23)19-26-16-14-25(2)15-17-26/h7-8,10-13,18,27H,3-6,9,14-17,19H2,1-2H3
n/an/a 1.32E+3n/an/an/an/an/an/a
Stony Brook University
Curated by ChEMBL
Assay Description
Inhibition of 100 nM Mycobacterium tuberculosis H37RV InhA
Bioorg Med Chem Lett 18: 3029-33 (2008)
Article DOI: 10.1016/j.bmcl.2008.04.038
BindingDB Entry DOI: 10.7270/Q2SB46KT