BDBM50373354 CHEMBL404984
SMILES: CCCCCCc1ccc(Oc2cccc(N)c2)c(O)c1
InChI Key: InChIKey=ZRRRBQYWHBBQGE-UHFFFAOYSA-N
Data: 2 IC50
Activity Spreadsheet -- Enzyme Inhibition Constant Data from BindingDB
Found 2 hits for monomerid = 50373354
Trg + Lig
Ki
nM
ΔG°
kcal/mole
IC50
nM
Kd
nM
EC50/IC50
nM
koff
s-1
kon
M-1s-1
pHTemp
°C
Enoyl-[acyl-carrier-protein] reductase [NADH]
(Mycobacterium tuberculosis (strain ATCC 25618 / H3...)
BDBM50373354
(CHEMBL404984)
Show SMILES CCCCCCc1ccc(Oc2cccc(N)c2)c(O)c1
Show InChI InChI=1S/C18H23NO2/c1-2-3-4-5-7-14-10-11-18(17(20)12-14)21-16-9-6-8-15(19)13-16/h6,8-13,20H,2-5,7,19H2,1H3
n/an/a 9.18E+5n/an/an/an/an/an/a
TBA
Assay Description
Inhibition of Mycobacterium tuberculosis InhA
Citation and Details
Article DOI: 10.1007/s00044-010-9518-8
BindingDB Entry DOI: 10.7270/Q2MG7SC4
Enoyl-ACP Reductase (InhA)
(Mycobacterium tuberculosis (strain ATCC 25618 / H3...)
BDBM50373354
(CHEMBL404984)
Show SMILES CCCCCCc1ccc(Oc2cccc(N)c2)c(O)c1
Show InChI InChI=1S/C18H23NO2/c1-2-3-4-5-7-14-10-11-18(17(20)12-14)21-16-9-6-8-15(19)13-16/h6,8-13,20H,2-5,7,19H2,1H3
n/an/a 1.09E+3n/an/an/an/an/an/a
Stony Brook University
Curated by ChEMBL
Assay Description
Inhibition of 100 nM Mycobacterium tuberculosis H37RV InhA
Bioorg Med Chem Lett 18: 3029-33 (2008)
Article DOI: 10.1016/j.bmcl.2008.04.038
BindingDB Entry DOI: 10.7270/Q2SB46KT