BDBM50373360 CHEMBL263917
SMILES: CC1(CCCCC1)Sc1nc2cc(Cl)c(cc2[nH]1)N1CCN(CCO)CC1
InChI Key: InChIKey=HQLKBNKGADRQPJ-UHFFFAOYSA-N
Data: 4 IC50
Activity Spreadsheet -- Enzyme Inhibition Constant Data from BindingDB
Found 4 hits for monomerid = 50373360
Trg + Lig
Ki
nM
ΔG°
kcal/mole
IC50
nM
Kd
nM
EC50/IC50
nM
koff
s-1
kon
M-1s-1
pHTemp
°C
Nociceptin receptor
(Homo sapiens (Human))
BDBM50373360
(CHEMBL263917)
Show SMILES CC1(CCCCC1)Sc1nc2cc(Cl)c(cc2[nH]1)N1CCN(CCO)CC1
Show InChI InChI=1S/C20H29ClN4OS/c1-20(5-3-2-4-6-20)27-19-22-16-13-15(21)18(14-17(16)23-19)25-9-7-24(8-10-25)11-12-26/h13-14,26H,2-12H2,1H3,(H,22,23)
Reactome pathway
n/an/a 1.80n/an/an/an/an/an/a
Banyu Tsukuba Research Institute
Curated by ChEMBL
Assay Description
Displacement of [125I]Tyr14-NC from human ORL1 receptor expressed in CHO cell membrane
Bioorg Med Chem Lett 18: 3278-81 (2008)
Article DOI: 10.1016/j.bmcl.2008.04.054
BindingDB Entry DOI: 10.7270/Q2HT2Q57
Nociceptin receptor
(Homo sapiens (Human))
BDBM50373360
(CHEMBL263917)
Show SMILES CC1(CCCCC1)Sc1nc2cc(Cl)c(cc2[nH]1)N1CCN(CCO)CC1
Show InChI InChI=1S/C20H29ClN4OS/c1-20(5-3-2-4-6-20)27-19-22-16-13-15(21)18(14-17(16)23-19)25-9-7-24(8-10-25)11-12-26/h13-14,26H,2-12H2,1H3,(H,22,23)
Reactome pathway
n/an/a 1.80n/an/an/an/an/an/a
Banyu Tsukuba Research Institute
Curated by ChEMBL
Assay Description
Antagonist activity at human ORL1 receptor expressed in CHO cell membrane by [35S]GTP-gamma-S binding assay
Bioorg Med Chem Lett 18: 3278-81 (2008)
Article DOI: 10.1016/j.bmcl.2008.04.054
BindingDB Entry DOI: 10.7270/Q2HT2Q57
Kappa-type opioid receptor
(Homo sapiens (Human))
BDBM50373360
(CHEMBL263917)
Show SMILES CC1(CCCCC1)Sc1nc2cc(Cl)c(cc2[nH]1)N1CCN(CCO)CC1
Show InChI InChI=1S/C20H29ClN4OS/c1-20(5-3-2-4-6-20)27-19-22-16-13-15(21)18(14-17(16)23-19)25-9-7-24(8-10-25)11-12-26/h13-14,26H,2-12H2,1H3,(H,22,23)
Reactome pathway
n/an/a 88n/an/an/an/an/an/a
Banyu Tsukuba Research Institute
Curated by ChEMBL
Assay Description
Displacement of [3H]U-69593 from human cloned kappa opioid receptor expressed in CHO cell membrane
Bioorg Med Chem Lett 18: 3278-81 (2008)
Article DOI: 10.1016/j.bmcl.2008.04.054
BindingDB Entry DOI: 10.7270/Q2HT2Q57
Mu-type opioid receptor
(Homo sapiens (Human))
BDBM50373360
(CHEMBL263917)
Show SMILES CC1(CCCCC1)Sc1nc2cc(Cl)c(cc2[nH]1)N1CCN(CCO)CC1
Show InChI InChI=1S/C20H29ClN4OS/c1-20(5-3-2-4-6-20)27-19-22-16-13-15(21)18(14-17(16)23-19)25-9-7-24(8-10-25)11-12-26/h13-14,26H,2-12H2,1H3,(H,22,23)
NCI pathway
Reactome pathway
n/an/a 1.40E+3n/an/an/an/an/an/a
Banyu Tsukuba Research Institute
Curated by ChEMBL
Assay Description
Displacement of [3H]diprenorphin from human cloned mu opioid receptor expressed in CHO cell membrane
Bioorg Med Chem Lett 18: 3278-81 (2008)
Article DOI: 10.1016/j.bmcl.2008.04.054
BindingDB Entry DOI: 10.7270/Q2HT2Q57