BDBM50373364 CHEMBL263903
SMILES: CCC(CC)Sc1nc2cc(Cl)c(cc2[nH]1)N1CCN(CC)CC1
InChI Key: InChIKey=SFAFOFYAVJUENM-UHFFFAOYSA-N
Data: 2 IC50
Activity Spreadsheet -- Enzyme Inhibition Constant Data from BindingDB
Found 2 hits for monomerid = 50373364
Trg + Lig
Ki
nM
ΔG°
kcal/mole
IC50
nM
Kd
nM
EC50/IC50
nM
koff
s-1
kon
M-1s-1
pHTemp
°C
Nociceptin receptor
(Homo sapiens (Human))
BDBM50373364
(CHEMBL263903)
Show SMILES CCC(CC)Sc1nc2cc(Cl)c(cc2[nH]1)N1CCN(CC)CC1
Show InChI InChI=1S/C18H27ClN4S/c1-4-13(5-2)24-18-20-15-11-14(19)17(12-16(15)21-18)23-9-7-22(6-3)8-10-23/h11-13H,4-10H2,1-3H3,(H,20,21)
Reactome pathway
n/an/a 10n/an/an/an/an/an/a
Banyu Tsukuba Research Institute
Curated by ChEMBL
Assay Description
Displacement of [125I]Tyr14-NC from human ORL1 receptor expressed in CHO cell membrane
Bioorg Med Chem Lett 18: 3278-81 (2008)
Article DOI: 10.1016/j.bmcl.2008.04.054
BindingDB Entry DOI: 10.7270/Q2HT2Q57
Nociceptin receptor
(Homo sapiens (Human))
BDBM50373364
(CHEMBL263903)
Show SMILES CCC(CC)Sc1nc2cc(Cl)c(cc2[nH]1)N1CCN(CC)CC1
Show InChI InChI=1S/C18H27ClN4S/c1-4-13(5-2)24-18-20-15-11-14(19)17(12-16(15)21-18)23-9-7-22(6-3)8-10-23/h11-13H,4-10H2,1-3H3,(H,20,21)
Reactome pathway
n/an/a 3.90n/an/an/an/an/an/a
Banyu Tsukuba Research Institute
Curated by ChEMBL
Assay Description
Antagonist activity at human ORL1 receptor expressed in CHO cell membrane by [35S]GTP-gamma-S binding assay
Bioorg Med Chem Lett 18: 3278-81 (2008)
Article DOI: 10.1016/j.bmcl.2008.04.054
BindingDB Entry DOI: 10.7270/Q2HT2Q57