BDBM50373661 CHEMBL257251
SMILES: CC(C)CN(CCP(O)(O)=O)C(=O)N[C@@H](Cc1ccc2ccccc2c1)C(O)=O
InChI Key: InChIKey=SOQUXQODIUOSQE-SFHVURJKSA-N
Data: 1 IC50
Activity Spreadsheet -- Enzyme Inhibition Constant Data from BindingDB
Found 1 hit for monomerid = 50373661
Trg + Lig
Ki
nM
ΔG°
kcal/mole
IC50
nM
Kd
nM
EC50/IC50
nM
koff
s-1
kon
M-1s-1
pHTemp
°C
Neprilysin
(Homo sapiens (Human))
BDBM50373661
(CHEMBL257251)
Show SMILES CC(C)CN(CCP(O)(O)=O)C(=O)N[C@@H](Cc1ccc2ccccc2c1)C(O)=O
Show InChI InChI=1S/C20H27N2O6P/c1-14(2)13-22(9-10-29(26,27)28)20(25)21-18(19(23)24)12-15-7-8-16-5-3-4-6-17(16)11-15/h3-8,11,14,18H,9-10,12-13H2,1-2H3,(H,21,25)(H,23,24)(H2,26,27,28)/t18-/m0/s1
n/an/a 6n/an/an/an/an/an/a
Universit£ de Montr£al
Curated by ChEMBL
Assay Description
Inhibition of NEP
Bioorg Med Chem Lett 18: 1058-62 (2008)
Article DOI: 10.1016/j.bmcl.2007.12.013
BindingDB Entry DOI: 10.7270/Q23N2483