null
SMILES: Nc1nc(NCc2ccc(cc2)C(=O)Nc2ccccc2N)c2[nH]cnc2n1
InChI Key: InChIKey=JWVMREBPZBOKLZ-UHFFFAOYSA-N
Activity Spreadsheet -- Enzyme Inhibition Constant Data from BindingDB
Found 1 hit for monomerid = 50373688
Trg + Lig
Ki
nM
ΔG°
kcal/mole
IC50
nM
Kd
nM
EC50/IC50
nM
koff
s-1
kon
M-1s-1
pHTemp
°C
Histone deacetylase 1
(Homo sapiens (Human))
BDBM50373688
(CHEMBL404518)
Show SMILES Nc1nc(NCc2ccc(cc2)C(=O)Nc2ccccc2N)c2[nH]cnc2n1
Show InChI InChI=1S/C19H18N8O/c20-13-3-1-2-4-14(13)25-18(28)12-7-5-11(6-8-12)9-22-16-15-17(24-10-23-15)27-19(21)26-16/h1-8,10H,9,20H2,(H,25,28)(H4,21,22,23,24,26,27)
NCI pathway
Reactome pathway
n/an/a 200n/an/an/an/an/an/a
MethylGene Inc.
Curated by ChEMBL
Assay Description
Inhibition of human recombinant HDAC1
Bioorg Med Chem Lett 18: 1067-71 (2008)
Article DOI: 10.1016/j.bmcl.2007.12.009
BindingDB Entry DOI: 10.7270/Q2ZW1MSD