BDBM50373822 CHEMBL257899
SMILES: COc1ccccc1N1CCN(CC(C)(C)Nc2nc(nc3ccccc23)C(F)(F)F)CC1
InChI Key: InChIKey=FDSBFCLFSPDFRP-UHFFFAOYSA-N
Data: 1 IC50
Activity Spreadsheet -- Enzyme Inhibition Constant Data from BindingDB
Found 1 hit for monomerid = 50373822
Trg + Lig
Ki
nM
ΔG°
kcal/mole
IC50
nM
Kd
nM
EC50/IC50
nM
koff
s-1
kon
M-1s-1
pHTemp
°C
Lysophosphatidic acid receptor 2
(Homo sapiens (Human))
BDBM50373822
(CHEMBL257899)
Show SMILES COc1ccccc1N1CCN(CC(C)(C)Nc2nc(nc3ccccc23)C(F)(F)F)CC1
Show InChI InChI=1S/C24H28F3N5O/c1-23(2,16-31-12-14-32(15-13-31)19-10-6-7-11-20(19)33-3)30-21-17-8-4-5-9-18(17)28-22(29-21)24(25,26)27/h4-11H,12-16H2,1-3H3,(H,28,29,30)
NCI pathway
Reactome pathway
n/an/a>3.00E+4n/an/an/an/an/an/a
Amgen Inc.
Curated by ChEMBL
Assay Description
Antagonist activity at LPA2 expressed in RH7777 cells with Gi4-protein and aequorin by calcium mobilization assay
Bioorg Med Chem Lett 18: 1037-41 (2008)
Article DOI: 10.1016/j.bmcl.2007.12.024
BindingDB Entry DOI: 10.7270/Q2JQ11W8