null
SMILES: CC(C)(C)Cn1cnc2ccc(nc12)-c1nc([nH]c1-c1ccccc1)-c1c(F)cccc1Cl
InChI Key: InChIKey=UCWSAMGSDVYLCT-UHFFFAOYSA-N
Activity Spreadsheet -- Enzyme Inhibition Constant Data from BindingDB
Found 2 hits for monomerid = 50373950
Trg + Lig
Ki
nM
ΔG°
kcal/mole
IC50
nM
Kd
nM
EC50/IC50
nM
koff
s-1
kon
M-1s-1
pHTemp
°C
Mitogen-activated protein kinase 14
(Mus musculus (mouse))
BDBM50373950
(CHEMBL409698)
Show SMILES CC(C)(C)Cn1cnc2ccc(nc12)-c1nc([nH]c1-c1ccccc1)-c1c(F)cccc1Cl
Show InChI InChI=1S/C26H23ClFN5/c1-26(2,3)14-33-15-29-20-13-12-19(30-25(20)33)23-22(16-8-5-4-6-9-16)31-24(32-23)21-17(27)10-7-11-18(21)28/h4-13,15H,14H2,1-3H3,(H,31,32)
Reactome pathway
n/an/a 39n/an/an/an/an/an/a
Eli Lilly and Co.
Curated by ChEMBL
Assay Description
Inhibition of mouse p38alpha in anisomycin-stimulated RAW 264.7 cells by ELISA
Bioorg Med Chem Lett 18: 179-83 (2008)
Article DOI: 10.1016/j.bmcl.2007.10.106
BindingDB Entry DOI: 10.7270/Q2R78G31
Mitogen-activated protein kinase 14
(Homo sapiens (Human))
BDBM50373950
(CHEMBL409698)
Show SMILES CC(C)(C)Cn1cnc2ccc(nc12)-c1nc([nH]c1-c1ccccc1)-c1c(F)cccc1Cl
Show InChI InChI=1S/C26H23ClFN5/c1-26(2,3)14-33-15-29-20-13-12-19(30-25(20)33)23-22(16-8-5-4-6-9-16)31-24(32-23)21-17(27)10-7-11-18(21)28/h4-13,15H,14H2,1-3H3,(H,31,32)
NCI pathway
Reactome pathway
n/an/a 3.20n/an/an/an/an/an/a
Eli Lilly and Co.
Curated by ChEMBL
Assay Description
Inhibition of human recombinant p38alpha
Bioorg Med Chem Lett 18: 179-83 (2008)
Article DOI: 10.1016/j.bmcl.2007.10.106
BindingDB Entry DOI: 10.7270/Q2R78G31