null
SMILES: CC(C)Cn1cnc2ccc(nc12)-c1nc([nH]c1-c1ccc(F)cc1F)C(C)(C)C
InChI Key: InChIKey=FMSSGRLJPZBEPE-UHFFFAOYSA-N
Activity Spreadsheet -- Enzyme Inhibition Constant Data from BindingDB
Found 2 hits for monomerid = 50373951
Trg + Lig
Ki
nM
ΔG°
kcal/mole
IC50
nM
Kd
nM
EC50/IC50
nM
koff
s-1
kon
M-1s-1
pHTemp
°C
Mitogen-activated protein kinase 14
(Mus musculus (mouse))
BDBM50373951
(CHEMBL271505)
Show SMILES CC(C)Cn1cnc2ccc(nc12)-c1nc([nH]c1-c1ccc(F)cc1F)C(C)(C)C
Show InChI InChI=1S/C23H25F2N5/c1-13(2)11-30-12-26-18-9-8-17(27-21(18)30)20-19(28-22(29-20)23(3,4)5)15-7-6-14(24)10-16(15)25/h6-10,12-13H,11H2,1-5H3,(H,28,29)
Reactome pathway
n/an/a 41.8n/an/an/an/an/an/a
Eli Lilly and Co.
Curated by ChEMBL
Assay Description
Inhibition of mouse p38alpha in anisomycin-stimulated RAW 264.7 cells by ELISA
Bioorg Med Chem Lett 18: 179-83 (2008)
Article DOI: 10.1016/j.bmcl.2007.10.106
BindingDB Entry DOI: 10.7270/Q2R78G31
Mitogen-activated protein kinase 14
(Homo sapiens (Human))
BDBM50373951
(CHEMBL271505)
Show SMILES CC(C)Cn1cnc2ccc(nc12)-c1nc([nH]c1-c1ccc(F)cc1F)C(C)(C)C
Show InChI InChI=1S/C23H25F2N5/c1-13(2)11-30-12-26-18-9-8-17(27-21(18)30)20-19(28-22(29-20)23(3,4)5)15-7-6-14(24)10-16(15)25/h6-10,12-13H,11H2,1-5H3,(H,28,29)
NCI pathway
Reactome pathway
n/an/a 3.90n/an/an/an/an/an/a
Eli Lilly and Co.
Curated by ChEMBL
Assay Description
Inhibition of human recombinant p38alpha
Bioorg Med Chem Lett 18: 179-83 (2008)
Article DOI: 10.1016/j.bmcl.2007.10.106
BindingDB Entry DOI: 10.7270/Q2R78G31