null
SMILES: CC(C)Cn1c(N)nc2ccc(nc12)-c1nc([nH]c1-c1ccccc1)-c1c(F)cccc1F
InChI Key: InChIKey=SYCOWGUWYABYOT-UHFFFAOYSA-N
Activity Spreadsheet -- Enzyme Inhibition Constant Data from BindingDB
Found 2 hits for monomerid = 50373967
Trg + Lig
Ki
nM
ΔG°
kcal/mole
IC50
nM
Kd
nM
EC50/IC50
nM
koff
s-1
kon
M-1s-1
pHTemp
°C
Mitogen-activated protein kinase 14
(Mus musculus (mouse))
BDBM50373967
(CHEMBL442972)
Show SMILES CC(C)Cn1c(N)nc2ccc(nc12)-c1nc([nH]c1-c1ccccc1)-c1c(F)cccc1F
Show InChI InChI=1S/C25H22F2N6/c1-14(2)13-33-24-19(30-25(33)28)12-11-18(29-24)22-21(15-7-4-3-5-8-15)31-23(32-22)20-16(26)9-6-10-17(20)27/h3-12,14H,13H2,1-2H3,(H2,28,30)(H,31,32)
Reactome pathway
n/an/a 35n/an/an/an/an/an/a
Eli Lilly and Co.
Curated by ChEMBL
Assay Description
Inhibition of mouse p38alpha in anisomycin-stimulated RAW 264.7 cells by ELISA
Bioorg Med Chem Lett 18: 179-83 (2008)
Article DOI: 10.1016/j.bmcl.2007.10.106
BindingDB Entry DOI: 10.7270/Q2R78G31
Mitogen-activated protein kinase 14
(Homo sapiens (Human))
BDBM50373967
(CHEMBL442972)
Show SMILES CC(C)Cn1c(N)nc2ccc(nc12)-c1nc([nH]c1-c1ccccc1)-c1c(F)cccc1F
Show InChI InChI=1S/C25H22F2N6/c1-14(2)13-33-24-19(30-25(33)28)12-11-18(29-24)22-21(15-7-4-3-5-8-15)31-23(32-22)20-16(26)9-6-10-17(20)27/h3-12,14H,13H2,1-2H3,(H2,28,30)(H,31,32)
NCI pathway
Reactome pathway
n/an/a 2.5n/an/an/an/an/an/a
Eli Lilly and Co.
Curated by ChEMBL
Assay Description
Inhibition of human recombinant p38alpha
Bioorg Med Chem Lett 18: 179-83 (2008)
Article DOI: 10.1016/j.bmcl.2007.10.106
BindingDB Entry DOI: 10.7270/Q2R78G31