BDBM50374035 CHEMBL256657
SMILES: Nc1ccc(cc1NC(=O)c1cccnc1)C1CCCC1
InChI Key: InChIKey=ZJSYDBWPQOPBRQ-UHFFFAOYSA-N
Data: 1 IC50
Activity Spreadsheet -- Enzyme Inhibition Constant Data from BindingDB
Found 1 hit for monomerid = 50374035
Trg + Lig
Ki
nM
ΔG°
kcal/mole
IC50
nM
Kd
nM
EC50/IC50
nM
koff
s-1
kon
M-1s-1
pHTemp
°C
Histone deacetylase 1
(Homo sapiens (Human))
BDBM50374035
(CHEMBL256657)
Show SMILES Nc1ccc(cc1NC(=O)c1cccnc1)C1CCCC1
Show InChI InChI=1S/C17H19N3O/c18-15-8-7-13(12-4-1-2-5-12)10-16(15)20-17(21)14-6-3-9-19-11-14/h3,6-12H,1-2,4-5,18H2,(H,20,21)
NCI pathway
Reactome pathway
n/an/a 4.20E+3n/an/an/an/an/an/a
Merck Research Laboratories
Curated by ChEMBL
Assay Description
Inhibition of HDAC1
Bioorg Med Chem Lett 18: 973-8 (2008)
Article DOI: 10.1016/j.bmcl.2007.12.031
BindingDB Entry DOI: 10.7270/Q2765G5S