BDBM50374036 CHEMBL403962
SMILES: Nc1ccc(cc1NC(=O)c1cccnc1)N1CCCC1
InChI Key: InChIKey=UTCLRIOLKBZVAT-UHFFFAOYSA-N
Data: 1 IC50
Activity Spreadsheet -- Enzyme Inhibition Constant Data from BindingDB
Found 1 hit for monomerid = 50374036
Trg + Lig
Ki
nM
ΔG°
kcal/mole
IC50
nM
Kd
nM
EC50/IC50
nM
koff
s-1
kon
M-1s-1
pHTemp
°C
Histone deacetylase 1
(Homo sapiens (Human))
BDBM50374036
(CHEMBL403962)
Show SMILES Nc1ccc(cc1NC(=O)c1cccnc1)N1CCCC1
Show InChI InChI=1S/C16H18N4O/c17-14-6-5-13(20-8-1-2-9-20)10-15(14)19-16(21)12-4-3-7-18-11-12/h3-7,10-11H,1-2,8-9,17H2,(H,19,21)
NCI pathway
Reactome pathway
n/an/a 670n/an/an/an/an/an/a
Merck Research Laboratories
Curated by ChEMBL
Assay Description
Inhibition of HDAC1
Bioorg Med Chem Lett 18: 973-8 (2008)
Article DOI: 10.1016/j.bmcl.2007.12.031
BindingDB Entry DOI: 10.7270/Q2765G5S