BDBM50374038 CHEMBL255804
SMILES: Nc1ccc(cc1NC(=O)c1cccnc1)-n1ccnc1
InChI Key: InChIKey=ZAIWVXFKSPNRJF-UHFFFAOYSA-N
Data: 1 IC50
Activity Spreadsheet -- Enzyme Inhibition Constant Data from BindingDB
Found 1 hit for monomerid = 50374038
Trg + Lig
Ki
nM
ΔG°
kcal/mole
IC50
nM
Kd
nM
EC50/IC50
nM
koff
s-1
kon
M-1s-1
pHTemp
°C
Cereblon/Histone deacetylase 1
(Homo sapiens (Human))
BDBM50374038
(CHEMBL255804)
Show SMILES Nc1ccc(cc1NC(=O)c1cccnc1)-n1ccnc1
Show InChI InChI=1S/C15H13N5O/c16-13-4-3-12(20-7-6-18-10-20)8-14(13)19-15(21)11-2-1-5-17-9-11/h1-10H,16H2,(H,19,21)
NCI pathway
Reactome pathway
n/an/a 1.00E+3n/an/an/an/an/an/a
Merck Research Laboratories
Curated by ChEMBL
Assay Description
Inhibition of HDAC1
Bioorg Med Chem Lett 18: 973-8 (2008)
Article DOI: 10.1016/j.bmcl.2007.12.031
BindingDB Entry DOI: 10.7270/Q2765G5S