BDBM50374040 CHEMBL256441
SMILES: Nc1ccc(cc1NC(=O)c1cccnc1)-c1ccsc1
InChI Key: InChIKey=SJCPWFXVNBYIIM-UHFFFAOYSA-N
Data: 1 IC50
Activity Spreadsheet -- Enzyme Inhibition Constant Data from BindingDB
Found 1 hit for monomerid = 50374040
Trg + Lig
Ki
nM
ΔG°
kcal/mole
IC50
nM
Kd
nM
EC50/IC50
nM
koff
s-1
kon
M-1s-1
pHTemp
°C
Histone deacetylase 1
(Homo sapiens (Human))
BDBM50374040
(CHEMBL256441)
Show SMILES Nc1ccc(cc1NC(=O)c1cccnc1)-c1ccsc1
Show InChI InChI=1S/C16H13N3OS/c17-14-4-3-11(13-5-7-21-10-13)8-15(14)19-16(20)12-2-1-6-18-9-12/h1-10H,17H2,(H,19,20)
NCI pathway
Reactome pathway
n/an/a 52n/an/an/an/an/an/a
Merck Research Laboratories
Curated by ChEMBL
Assay Description
Inhibition of HDAC1
Bioorg Med Chem Lett 18: 973-8 (2008)
Article DOI: 10.1016/j.bmcl.2007.12.031
BindingDB Entry DOI: 10.7270/Q2765G5S