BDBM50374057 CHEMBL407560
SMILES: CC(=O)Nc1ccc(cc1)C(=O)Nc1cc(ccc1N)-c1ccsc1
InChI Key: InChIKey=FCJSXPHWIKTARV-UHFFFAOYSA-N
Data: 1 IC50
Activity Spreadsheet -- Enzyme Inhibition Constant Data from BindingDB
Found 1 hit for monomerid = 50374057
Trg + Lig
Ki
nM
ΔG°
kcal/mole
IC50
nM
Kd
nM
EC50/IC50
nM
koff
s-1
kon
M-1s-1
pHTemp
°C
Histone deacetylase 1
(Homo sapiens (Human))
BDBM50374057
(CHEMBL407560)
Show SMILES CC(=O)Nc1ccc(cc1)C(=O)Nc1cc(ccc1N)-c1ccsc1
Show InChI InChI=1S/C19H17N3O2S/c1-12(23)21-16-5-2-13(3-6-16)19(24)22-18-10-14(4-7-17(18)20)15-8-9-25-11-15/h2-11H,20H2,1H3,(H,21,23)(H,22,24)
NCI pathway
Reactome pathway
n/an/a 7n/an/an/an/an/an/a
Merck Research Laboratories
Curated by ChEMBL
Assay Description
Inhibition of HDAC1
Bioorg Med Chem Lett 18: 973-8 (2008)
Article DOI: 10.1016/j.bmcl.2007.12.031
BindingDB Entry DOI: 10.7270/Q2765G5S